program: Gaussian 09
title: 000156209
version: EM64L-G09RevD.01
frameworkgroup: C1[X(C12H5Cl2FO2)]
method: RPBEPBE
basis: SDD
operation: Freq
keyword: #p
keyword: freq=noraman
keyword: PBEPBE/SDD
title: #p freq=noraman PBEPBE/SDD
converged: NO NO NO YES
title: Mulliken charges:
elementType: Cl Cl F O O C C C C C C C C C C C C H H H H H
charge: 0.004792 0.004522 -0.197671 -0.273901 -0.272236 0.258682 0.269422 0.303758 0.227727 -0.346292 -0.349263 -0.530674 -0.325315 -0.084634 -0.082643 0.364398 -0.374578 0.290044 0.289625 0.290351 0.267809 0.266074
chargesum: 0.00000
title: Mulliken charges with hydrogens summed into heavy atoms:
elementType: Cl Cl F O O C C C C C C C C C C C C
charge: 0.004792 0.004522 -0.197671 -0.273901 -0.272236 0.258682 0.269422 0.303758 0.227727 -0.056247 -0.059637 -0.240323 -0.057506 -0.084634 -0.082643 0.364398 -0.108503
polarizability: 2.78668787e+02 -4.60089426e+00 1.50982979e+02 -2.51785442e-03 3.93521714e-03 5.61174363e+01
1716.lowfreq: -0.0024 -0.0021 0.0011 3.9089 5.3006 6.3297 30.7718 64.6990 132.2799
frequency: 30.7685 64.6962 132.2796 136.7460 151.0860 178.9643 205.2878 246.9299 259.1516 274.7785 348.7629 354.9083 367.8657 418.4938 443.7837 448.9723 466.9228 492.6221 527.2134 562.0902 568.1481 590.6850 645.2297 656.1172 675.1836 684.0194 715.5385 755.2240 800.6746 826.6713 840.9044 852.4327 867.6189 890.7043 925.2998 949.0562 1074.1228 1098.2743 1105.8577 1132.3259 1155.4777 1219.9833 1227.5858 1248.7500 1283.0089 1355.0169 1366.1529 1389.4315 1426.4081 1464.4639 1483.8351 1576.4974 1590.1478 1614.5375 1638.7413 3170.3837 3180.9998 3183.7763 3189.3849 3192.6230
redmass: 13.9902 8.4915 12.3472 10.1930 8.8377 30.2348 7.1388 14.2656 7.3007 13.4104 11.5488 7.6674 11.7945 8.9616 3.0915 3.1185 8.7196 5.8613 9.7760 10.2008 5.5628 9.7825 7.8927 3.8801 3.7944 8.4092 7.3824 7.1084 1.3504 5.9864 1.4285 1.4880 1.3865 7.8472 1.3218 4.6754 2.6634 1.6846 5.6671 1.6669 2.1582 1.3368 4.5168 1.4381 6.1867 7.7670 9.2340 8.0571 4.8764 3.8224 3.4887 10.3352 7.7805 9.1951 8.2243 1.0895 1.0925 1.0931 1.0935 1.0969
irintensity: 0.0181 0.3637 0.0732 0.0910 1.4627 0.0224 0.7304 0.0086 0.0032 0.8162 1.3965 0.3015 3.0987 5.7748 3.7866 10.4099 15.1548 2.4385 2.4742 4.5003 5.1473 0.9471 7.4100 0.5799 1.2876 8.0190 0.1807 12.8830 31.4862 94.1206 1.3405 51.1621 69.2594 60.9579 0.7996 67.0128 28.3215 93.3258 16.8394 77.8754 85.4646 0.2729 21.6579 23.5988 243.1212 15.8814 78.9424 0.2343 24.0552 727.2817 204.9595 16.5462 15.3535 15.2361 22.1793 1.3847 2.6688 1.4671 1.5533 0.4064
temp: 298.150 k
press: 1.00000 atm
elementType: 17 17 9 8 8 6 6 6 6 6 6 6 6 6 6 6 6 1 1 1 1 1
symmnumber: 1
zpe: 357226.6 jmol-1
zpe.correction: 0.136060 hartree
zpe.thermalcorrener: 0.149648 hartree
zpe.thermalcorrenthalpy: 0.150593 hartree
zpe.thermalcorrgfe: 0.094718 hartree
zpe.sumelectzpe: -1629.491094 hartree
zpe.sumelectthermal: -1629.477506 hartree
zpe.sumelectthermalent: -1629.476562 hartree
zpe.sumelectthermalfe: -1629.532436 hartree
dipole: -1.4264 1.0960 0.0000
dipole: 1.7988
quadrupole: -122.8942 -102.7682 -112.4254
quadrupole: -6.6280 0.0000 0.0002
quadrupole: -10.1982 9.9277 0.2706 -6.6280 0.0000 0.0002
hfenergy: -1629.6271542 hartree
pointgroup: C01 [X(C12H5Cl2F1O2)]
dipole: 0.5594621 0.4334415 0.000001 debye
dipolederiv: -0.5671631 -0.2983828 0.0000414 -0.3842738 -0.2801409 0.0000317 0.0000578 0.000034 -0.021407 -0.6395155 0.2609547 -0.0000001 0.3463814 -0.2106903 0.0000012 -0.0000007 0.0000013 -0.0219258 -1.1126251 0.3289857 -0.0000343 0.4629447 -0.3726207 0.0000185 -0.0000568 0.0000206 -0.1456668 -2.095315 -0.0704571 0.0000146 -0.0827519 -0.3602287 -0.000008 0.0000102 -0.0000218 -0.1503493 -2.0638509 -0.1065361 0.0000169 -0.1586323 -0.3459496 0.0000212 0.0000234 0.0000364 -0.1447009 1.3298939 -0.1287041 -0.0000363 -0.9123153 0.0873296 0.000014 -0.0000191 0.0000131 0.0716084 1.2180241 0.2497507 -0.0000474 1.0377246 0.2075971 -0.0000236 -0.0000841 -0.0000231 0.0771084 1.264918 0.1647945 0.0000202 1.0052488 0.2773938 0.0000014 0.000005 0.0000065 0.0873378 1.2149967 -0.1349918 0.0000271 -0.9282549 -0.0414546 -0.0000021 0.0000623 -0.0000108 0.0499783 -0.3621901 -0.0753775 0.0000132 -0.1117649 -0.0716941 0.0000078 0.0000198 0.0000052 -0.1003269 -0.4101676 0.0384168 -0.0000022 0.0870093 -0.0540554 -0.0000054 0.0000028 -0.0000046 -0.1030601 -0.5017783 0.0280662 -0.0000015 -0.0505816 -0.0458624 0. -0.0000089 0.0000008 -0.1670669 -0.0656293 0.0664803 0.0000072 -0.0604034 0.0867072 -0.0000105 0.0000072 -0.0000057 -0.1392639 0.6071156 0.5703443 -0.0000789 0.6552327 0.3585513 -0.0000542 -0.000106 -0.0000599 -0.0661856 0.7524221 -0.5279789 0.000019 -0.6076797 0.237895 0.0000037 0.0000222 0.0000069 -0.0643778 1.2154615 -0.3211848 0.0000425 -0.4959523 0.4810839 -0.0000272 0.0000704 -0.0000262 0.0863808 -0.1993206 -0.0162512 0.0000042 0.2299193 -0.1334467 0.000008 0.0000002 0.0000012 -0.1776488 0.0966784 0.0247406 0.0000035 0.0192691 0.0408558 0.0000064 0.0000098 0.0000094 0.181398 0.0986956 -0.0182826 0.0000046 -0.0116895 0.0355796 0.000006 0.0000003 0.0000065 0.1815248 0.1178296 -0.0155394 -0.0000037 -0.0030676 0.0361524 0.0000046 -0.000004 0.0000047 0.2005361 0.1060239 0.03285 -0.0000042 0.0182074 -0.0086563 0.0000057 -0.0000042 0.0000048 0.1755823 -0.0045041 -0.0516976 -0.0000058 -0.0545704 0.075654 0.0000008 -0.0000075 0.0000006 0.1905251 unknown
polarizability: 278.6297966|5.1132365|151.0219689|-0.002502|-0.0039453|56.1174363 unknown
InChI: InChI=1S/C12H5Cl2FO2/c13-7-4-11-12(5-8(7)14)17-10-3-6(15)1-2-9(10)16-11/h1-5H
charge 0 multiplicity 1
22 atoms
Cl -4.761139 -1.828315 0.000234
Cl -4.940629 1.463095 0.00002
F  5.204172 -1.038743 0.000106
O  0.393966 -1.362452 -0.000095
O  0.234587 1.560913 -0.000183
C  -0.84474 -0.672846 -0.000047
C  -0.920815 0.743271 -0.000084
C  1.554755 -0.545042 -0.000059
C  1.479788 0.871178 -0.000098
C  -2.015077 -1.44377 0.00004
C  -2.169415 1.380866 -0.000051
C  2.798519 -1.194338 0.000013
C  2.652395 1.642034 -0.000075
C  -3.272667 -0.802907 0.000079
C  -3.349136 0.606124 0.000019
C  3.955819 -0.394153 0.000034
C  3.91719 1.009992 -0.000007
H  -1.941064 -2.533918 0.000091
H  -2.215259 2.472598 -0.000091
H  2.855626 -2.285242 0.000045
H  2.565449 2.731909 -0.000109
H  4.844375 1.587946 0.000018
