program: Gaussian 09
title: 000156177
version: EM64L-G09RevD.01
frameworkgroup: C1[X(C14H13NO)]
method: RPBEPBE
basis: SDD
operation: Freq
keyword: #p
keyword: freq=noraman
keyword: PBEPBE/SDD
title: #p freq=noraman PBEPBE/SDD
converged: YES YES NO NO
title: Mulliken charges:
elementType: O N C C C C C C C C C C C C C C H H H H H H H H H H H H H
charge: -0.207477 -0.612649 -0.515670 0.141495 -0.210028 0.195227 0.237544 -0.045603 0.426714 -0.425947 -0.459665 -0.393319 -0.642158 0.461117 -0.369874 -0.809956 0.263715 0.220410 0.241578 0.270349 0.242636 0.241350 0.310144 0.265786 0.246893 0.233860 0.227767 0.232678 0.233083
chargesum: 0.00000
title: Mulliken charges with hydrogens summed into heavy atoms:
elementType: O N C C C C C C C C C C C C C C
charge: -0.207477 -0.036719 -0.031545 0.141495 0.031550 0.195227 0.237544 -0.045603 0.426714 -0.155599 -0.217029 -0.151969 -0.395266 0.461117 -0.136014 -0.116427
polarizability: 2.71151841e+02 -1.51775018e+01 1.66992121e+02 3.41611715e-01 -1.60075714e+00 7.69636667e+01
1716.lowfreq: -8.1769 -7.0652 -0.0007 0.0005 0.0007 7.4020 54.6299 72.6782 86.6444
frequency: 54.6181 72.6772 86.6423 118.6800 150.7225 174.4247 231.6076 243.8957 260.9007 291.7935 298.6170 312.9985 405.9143 413.8460 438.6405 481.8021 514.5293 534.7517 547.6215 560.6582 578.7852 626.7658 640.1541 659.7499 716.0413 741.8450 779.0253 806.2799 821.4127 843.0867 858.5928 911.1050 921.0560 947.3861 973.4361 978.9648 988.1045 1002.6365 1005.0898 1049.0636 1058.4835 1117.9845 1144.7362 1151.9705 1162.8960 1175.0598 1187.6100 1240.0950 1251.6606 1265.9737 1274.7763 1295.7786 1341.6331 1358.5740 1393.0465 1397.4795 1418.7605 1431.6965 1451.5573 1466.3420 1468.0275 1476.8686 1521.3471 1586.0246 1598.8201 1610.2683 1637.2845 1653.2837 2863.7607 2976.1764 2994.1895 3050.8501 3053.2113 3088.3224 3118.3232 3121.9246 3129.1013 3147.6359 3160.4124 3450.7985 3588.4894
redmass: 3.8256 3.1836 1.2542 3.1329 4.0180 4.0313 2.5816 1.2555 4.2354 3.9234 4.2213 4.6230 2.9979 3.0880 3.5623 5.2188 3.3789 3.3218 4.7434 4.1122 4.1231 1.6285 3.5336 3.4029 6.1160 3.1182 3.6725 2.5291 1.5670 1.6726 3.7395 1.5787 2.8496 2.4172 1.3498 3.6532 1.4680 1.7880 2.2330 1.5781 3.1371 1.3343 1.2013 1.3463 1.7884 1.5476 1.4912 1.7194 2.0080 2.5938 2.0505 1.6447 1.7503 2.4900 3.0112 1.3013 3.8122 8.0118 1.2444 1.5288 1.0458 1.6041 3.8198 8.0743 5.7802 3.1261 4.2851 1.7387 1.0799 1.0375 1.0597 1.1027 1.0973 1.0988 1.0916 1.0870 1.0884 1.0970 1.0967 1.0471 1.0959
irintensity: 0.5870 1.3214 1.5164 1.1377 1.2347 2.0921 9.6640 18.8357 5.5295 2.1508 9.2042 2.7846 2.2392 4.6032 13.3541 3.3811 10.7460 3.3196 1.0447 2.3950 18.7476 174.8370 10.4873 36.1354 4.8305 7.1799 1.1838 10.2064 7.0661 50.2370 10.9208 19.0373 0.8688 4.2517 1.0597 42.3581 5.1963 4.2340 12.0726 13.7705 26.0496 0.3323 2.0126 2.1421 11.6860 0.7782 3.3690 0.0760 27.0220 13.6238 31.3073 43.9927 4.5177 12.6978 7.1900 13.7038 10.6376 5.9984 22.9510 32.5162 13.9365 23.2868 6.9695 8.3267 95.0740 398.9724 10.0580 45.8322 50.5063 36.9310 16.2688 12.9012 19.0052 16.6809 14.4722 10.2599 10.8685 20.0583 11.5774 5.8316 7.8660
temp: 298.150 k
press: 1.00000 atm
elementType: 8 7 6 6 6 6 6 6 6 6 6 6 6 6 6 6 1 1 1 1 1 1 1 1 1 1 1 1 1
symmnumber: 1
zpe: 609647.8 jmol-1
zpe.correction: 0.232203 hartree
zpe.thermalcorrener: 0.245813 hartree
zpe.thermalcorrenthalpy: 0.246757 hartree
zpe.thermalcorrgfe: 0.192118 hartree
zpe.sumelectzpe: -670.164704 hartree
zpe.sumelectthermal: -670.151094 hartree
zpe.sumelectthermalent: -670.150150 hartree
zpe.sumelectthermalfe: -670.204789 hartree
dipole: 3.7976 -2.2936 1.3017
dipole: 4.6234
quadrupole: -87.9910 -85.7049 -97.7428
quadrupole: 9.8820 -5.1085 -2.3549
quadrupole: 2.4886 4.7747 -7.2632 9.8820 -5.1085 -2.3549
hfenergy: -670.3969071 hartree
pointgroup: C01 [X(C14H13N1O1)]
dipole: 1.5242734 0.8505392 -0.511807 debye
polarizability: 272.1001595|11.4195774|166.0531432|-0.7639728|-1.2398427|76.9543258 unknown
InChI: InChI=1S/C14H13NO/c1-8-2-4-10-9(6-8)3-5-11-12(10)7-13(15)14(11)16/h2-6,13H,7,15H2,1H3
charge 0 multiplicity 1
29 atoms
O  -3.884589 -1.193928 0.107416
N  -4.159474 1.666484 0.402109
C  -1.62351 1.674332 -0.015009
C  -0.715252 0.451794 -0.041772
C  -3.038786 1.10453 -0.350455
C  -1.463895 -0.73911 -0.05405
C  0.71408 0.403397 -0.018321
C  -2.906232 -0.417456 -0.076094
C  1.352814 -0.900674 -0.00148
C  -0.844577 -2.026484 -0.017269
C  0.546403 -2.095858 0.002199
C  1.540542 1.574689 -0.004123
C  2.783115 -0.968352 0.019625
C  3.579381 0.185028 0.026911
C  2.931024 1.467948 0.01579
C  5.094368 0.106893 0.048911
H  -1.666278 2.115032 0.998821
H  -1.299164 2.467486 -0.713581
H  -3.174284 1.180951 -1.458877
H  -1.46897 -2.925567 -0.010372
H  1.053817 -3.067495 0.021783
H  1.065923 2.56233 -0.006407
H  -4.856917 0.954498 0.65072
H  -4.577192 2.509806 0.002908
H  3.260618 -1.956106 0.032169
H  3.549593 2.373664 0.024876
H  5.448148 -0.937779 0.060608
H  5.532667 0.603631 -0.8374
H  5.507525 0.615515 0.940464
