program: Gaussian 09
title: 000156132
version: EM64L-G09RevD.01
frameworkgroup: C1[X(C11H12FNO)]
method: RPBEPBE
basis: SDD
operation: Freq
keyword: #p
keyword: freq=noraman
keyword: PBEPBE/SDD
title: #p freq=noraman PBEPBE/SDD
converged: YES YES NO NO
title: Mulliken charges:
elementType: F O N C C C C C C C C C C C H H H H H H H H H H H H
charge: -0.202299 -0.278184 -0.126798 0.192401 -0.378645 -0.712832 -0.712563 0.091778 0.310313 -0.337708 -0.315068 -0.361232 -0.363793 0.327475 0.230331 0.230471 0.205780 0.227585 0.235325 0.227658 0.205829 0.235382 0.277956 0.274316 0.258677 0.257845
chargesum: 0.00000
title: Mulliken charges with hydrogens summed into heavy atoms:
elementType: F O N C C C C C C C C C C C
charge: -0.202299 -0.278184 -0.126798 0.192401 0.082157 -0.044142 -0.043695 0.091778 0.310313 -0.059752 -0.040752 -0.102554 -0.105948 0.327475
polarizability: 1.97747939e+02 -3.40568586e+00 1.21749987e+02 2.56102293e-02 2.88281498e-02 7.42174394e+01
1716.lowfreq: -3.1492 0.0008 0.0010 0.0011 8.5781 10.3054 28.9378 57.6310 71.9946
frequency: 28.8490 57.5316 71.9759 107.0322 153.7821 216.4852 249.9952 254.3620 289.9450 326.4025 335.9692 343.1450 391.5411 412.9947 451.7179 478.0134 514.7495 572.4632 608.0622 627.8914 652.0939 730.1727 785.1199 796.6472 825.0027 840.6816 847.4226 862.0714 918.3794 921.7233 946.9073 966.6151 968.4254 979.4870 997.6009 1011.0982 1016.9810 1103.5176 1148.0246 1155.1701 1170.8657 1194.8214 1209.7562 1242.5675 1284.7922 1290.8860 1324.0227 1374.8441 1380.6580 1393.5229 1410.5189 1453.6527 1465.4566 1470.8797 1476.4807 1488.4066 1491.1849 1590.5777 1608.4031 1624.1950 2981.2180 2984.5159 3021.2588 3077.2663 3082.6070 3087.2218 3097.1413 3098.7769 3161.9150 3166.1967 3180.5907 3185.8515
redmass: 3.0894 4.1532 5.4112 5.0618 5.1051 1.0699 2.9402 1.2138 4.5958 5.0640 2.5692 2.9039 3.8818 2.9764 3.6873 3.8234 2.9967 5.6129 5.2823 6.9046 5.5998 4.2171 6.6010 5.9166 1.2450 4.7142 1.6037 3.9158 1.6807 7.3860 1.2579 1.3491 2.1123 1.3494 4.9472 1.3606 2.6330 1.2965 1.2108 1.4111 2.3514 2.1166 2.7349 2.6702 3.1937 1.3946 1.4537 1.2113 6.1046 1.2330 3.9076 1.0491 1.0487 1.0595 1.0790 1.0642 2.7819 8.4325 7.9088 7.9512 1.0354 1.0360 1.0571 1.1000 1.0995 1.1081 1.1035 1.0994 1.0890 1.0888 1.0973 1.0979
irintensity: 0.0095 0.3657 0.2510 0.2845 4.7934 0.0061 0.6197 0.3345 1.6990 7.2598 1.8542 0.1288 0.4574 0.0239 6.7396 2.0407 5.5811 10.6906 18.3519 2.8838 21.9238 5.7035 22.2994 1.8904 0.4189 10.2495 81.4372 6.4166 0.1598 44.5158 1.5727 0.8094 18.9775 0.1300 71.5584 0.2552 31.0396 8.8736 0.2323 76.9067 43.5991 9.2676 25.9645 11.3670 53.4784 19.7094 42.5006 21.8403 9.4411 6.8419 11.3183 2.9350 4.4458 8.1452 20.6622 4.2950 130.8521 8.6854 27.2644 138.3954 22.9215 29.7731 47.9366 10.9185 54.8459 8.6716 24.8390 37.2738 0.6784 2.1544 2.9834 2.9445
temp: 298.150 k
press: 1.00000 atm
elementType: 9 8 7 6 6 6 6 6 6 6 6 6 6 6 1 1 1 1 1 1 1 1 1 1 1 1
symmnumber: 1
zpe: 538541.5 jmol-1
zpe.correction: 0.205120 hartree
zpe.thermalcorrener: 0.217954 hartree
zpe.thermalcorrenthalpy: 0.218898 hartree
zpe.thermalcorrgfe: 0.165057 hartree
zpe.sumelectzpe: -655.155953 hartree
zpe.sumelectthermal: -655.143118 hartree
zpe.sumelectthermalent: -655.142174 hartree
zpe.sumelectthermalfe: -655.196016 hartree
dipole: 3.1107 0.7635 -0.0087
dipole: 3.2030
quadrupole: -80.4930 -78.0434 -83.3158
quadrupole: 1.5170 -0.0259 0.0867
quadrupole: 0.1244 2.5740 -2.6984 1.5170 -0.0259 0.0867
hfenergy: -655.3610722 hartree
pointgroup: C01 [X(C11H12F1N1O1)]
dipole: -1.2228748 0.304152 -0.0105287 debye
dipolederiv: -1.3267732 0.0754457 0.0140529 0.1000199 -0.2158747 0.0063674 0.0107804 0.0068027 -0.1520443 -0.8929732 0.3278737 -0.0266891 0.16693 -0.8471923 0.0693816 -0.0054489 0.0660216 -0.2333926 -0.9371544 -0.1537035 0.028439 -0.1747854 -0.591289 0.0264888 0.0266314 0.0245346 -0.398071 0.521054 0.10785 -0.0172924 -0.0389256 0.1375986 0.0205715 0.0033666 0.0186602 0.3045876 0.4374073 -0.2280435 0.0248436 -0.0670181 0.0757974 0.025026 0.0058933 0.0278201 0.272579 -0.0525158 -0.0610498 -0.0235917 0.0524688 0.0524288 -0.0409731 -0.0143621 -0.0285833 -0.0559125 -0.0534573 -0.0533182 0.0365296 0.0573746 0.0622583 0.0098758 -0.0003715 0.0021375 -0.0688578 1.2831711 -0.1297269 -0.0075128 -0.1869175 1.0098242 -0.102838 -0.002359 -0.1040618 0.1047071 -0.2321194 0.06119 -0.0027719 0.0806437 -0.1272662 0.0147081 -0.0030281 0.0152276 0.005744 0.0909552 -0.0018322 -0.0039767 -0.0768579 0.0653207 -0.0208675 0.0049624 -0.0217369 -0.1049462 0.1716412 -0.0184857 -0.0035163 0.0442542 0.0466042 -0.0223193 -0.0113623 -0.0206222 -0.1154304 -0.3093668 -0.0437495 0.0088373 -0.2373134 -0.0197082 -0.0133692 0.0339624 -0.0171718 -0.1578674 -0.2956528 0.0759457 -0.0071484 0.3220526 -0.0688689 -0.0184567 -0.0388875 -0.0135285 -0.1593318 1.3918886 -0.0794865 -0.016004 -0.1257689 0.3223906 -0.0265359 -0.0099387 -0.0275067 0.1001111 -0.0256292 0.0567486 -0.0474135 0.0380888 0.0611077 0.0563527 -0.0984203 0.0986277 -0.0869114 -0.0196741 0.0619655 0.0315609 0.0585915 0.0168839 -0.0836653 0.0847496 -0.1261811 -0.045831 -0.1862275 0.0472689 -0.0303756 0.0905803 0.0459655 -0.0037643 -0.033385 -0.0343924 0.0792082 0.0524895 -0.0240111 0.103175 -0.034672 0.0706459 0.0536543 0.0709319 0.0260197 -0.1060948 0.113344 0.0009221 -0.0119466 -0.0528512 -0.126436 -0.0019603 -0.0001676 0.0505522 0.083844 0.0442788 -0.0508536 -0.1005385 -0.054544 0.0425988 -0.0869296 -0.0667866 -0.0597085 -0.0698963 -0.1842035 0.0557439 0.0297945 0.0971624 0.056171 0.0046489 0.0239426 0.0373733 0.0669707 0.1145775 0.0030068 0.010093 -0.0494248 -0.1254963 0.0555613 0.0107722 0.0006761 0.0820667 0.1011912 -0.0759399 0.0109336 -0.0616993 0.0359426 0.0161016 0.0093417 0.0161562 0.1475128 0.1200703 0.0543021 -0.0063015 0.0593067 0.009915 0.0178285 -0.0074373 0.017681 0.1542246 0.0486319 0.0563119 -0.0046101 0.0713557 -0.0053392 0.0224342 -0.0065016 0.022788 0.1765623 0.0250467 -0.0643746 0.01143 -0.0780511 0.0160176 0.0226786 0.0131221 0.0224148 0.1764694 unknown
polarizability: 197.7145743|2.9057914|120.9621268|-2.8216404|-6.0097654|75.0386635 unknown
InChI: InChI=1S/C11H12FNO/c1-11(2)7-14-10(13-11)8-3-5-9(12)6-4-8/h3-6H,7H2,1-2H3
charge 0 multiplicity 1
26 atoms
F  4.866454 -0.284568 -0.063798
O  -1.310903 1.501892 -0.152727
N  -1.642945 -0.792274 0.121297
C  -3.035798 -0.209356 0.084144
C  -2.7988 1.337617 -0.107169
C  -3.802864 -0.827451 -1.105798
C  -3.741511 -0.523925 1.422027
C  -0.786349 0.186171 -0.009903
C  0.682275 0.078728 -0.026008
C  1.288198 -1.197675 0.126105
C  1.494106 1.231718 -0.190644
C  2.690167 -1.326366 0.114471
C  2.899883 1.117134 -0.204443
C  3.463196 -0.161477 -0.051251
H  -3.201651 1.722932 -1.059005
H  -3.170453 1.941038 0.7380
H  -4.832236 -0.425853 -1.156959
H  -3.29179 -0.609912 -2.060502
H  -3.859828 -1.923479 -0.990554
H  -3.187733 -0.087176 2.272032
H  -4.770435 -0.117996 1.424643
H  -3.795206 -1.615682 1.573752
H  0.644255 -2.073042 0.252125
H  1.017408 2.20877 -0.306693
H  3.180637 -2.296949 0.229939
H  3.547123 1.989582 -0.329983
