program: Gaussian 09
title: 000156121
version: EM64L-G09RevD.01
frameworkgroup: C1[X(C7H13NO4)]
method: RPBEPBE
basis: SDD
operation: Freq
keyword: #p
keyword: freq=noraman
keyword: PBEPBE/SDD
title: #p freq=noraman PBEPBE/SDD
converged: YES YES NO NO
title: Mulliken charges:
elementType: O O O O N C C C C C C C H H H H H H H H H H H H H
charge: -0.322545 -0.259456 -0.233867 -0.297147 -0.381422 0.262107 -0.700298 -0.717455 0.223318 0.346315 -0.502829 -0.609768 0.229034 0.269344 0.213164 0.218796 0.232101 0.252427 0.327629 0.230761 0.252730 0.238661 0.226786 0.230742 0.270873
chargesum: 0.00000
title: Mulliken charges with hydrogens summed into heavy atoms:
elementType: O O O O N C C C C C C C
charge: -0.322545 -0.259456 -0.233867 -0.297147 -0.053793 0.262107 0.011244 -0.014131 0.223318 0.346315 0.219322 0.118634
polarizability: 1.18694152e+02 -3.32181921e-01 9.24605420e+01 -7.47746973e+00 -2.19401158e+00 8.12055985e+01
1716.lowfreq: -8.0392 -3.4222 0.0004 0.0007 0.0013 9.4807 25.9715 52.7708 93.7722
frequency: 25.6736 52.7380 93.7586 101.7019 111.5919 122.7984 141.8805 163.6066 190.3923 214.4066 238.7103 256.3738 263.3220 305.9412 314.9095 339.4765 362.0889 413.2592 528.6837 573.2314 587.0339 669.9606 698.5191 710.6725 757.0245 826.9587 896.2722 929.2594 940.4435 948.6509 1009.0384 1094.7641 1112.8557 1113.3678 1126.4101 1145.7289 1147.9984 1158.8096 1210.1288 1221.1979 1249.4619 1374.8369 1392.1422 1420.2078 1430.5478 1451.4625 1451.6265 1461.1603 1463.9304 1464.8359 1468.8891 1484.5845 1488.4168 1516.5536 1640.1604 1672.6124 2979.1423 2998.5966 3005.0899 3005.9907 3056.3190 3099.3335 3106.0420 3109.7062 3112.2718 3112.7355 3126.6888 3150.8894 3578.3068
redmass: 5.0352 3.9608 1.3296 1.0889 2.7890 3.5715 3.4111 3.5431 1.6500 1.5571 1.4252 3.8568 1.9312 3.2012 3.6237 4.8197 5.1199 3.6633 4.1120 1.1975 3.0542 5.8868 11.6598 6.8928 5.6798 3.8538 4.0157 2.4772 2.5168 2.1852 1.3131 4.8179 3.5122 1.3089 1.2854 1.6659 1.4839 2.3552 3.3482 2.6350 3.3383 1.2085 1.2085 1.1801 1.1651 1.0501 1.0489 1.2997 1.0529 1.0563 1.0562 1.0445 1.0566 1.4345 10.2093 8.8771 1.0354 1.0345 1.0362 1.0294 1.1027 1.1003 1.0993 1.1046 1.1012 1.0980 1.1003 1.1051 1.0772
irintensity: 6.0888 7.5719 0.4938 0.6727 1.0614 3.4431 0.7544 1.8974 1.3264 2.2777 1.5409 0.5780 1.8525 13.4544 16.7310 17.5756 7.8060 6.5312 5.3554 128.7382 2.2315 15.1529 23.2231 9.0148 6.2006 9.8043 33.1964 9.6156 2.0581 31.2327 5.4787 423.0863 131.0877 6.6832 0.9164 28.2117 18.5492 110.4223 40.9822 83.2507 44.1479 33.1025 17.9115 13.9423 33.2125 17.4176 9.1648 112.9726 3.6504 9.4749 12.7976 13.8822 32.0515 135.4955 172.1016 288.6919 81.3865 11.3517 26.9358 28.2037 37.4341 0.6718 39.4451 22.1819 14.7112 4.2290 9.4232 16.1436 39.9861
temp: 298.150 k
press: 1.00000 atm
elementType: 8 8 8 8 7 6 6 6 6 6 6 6 1 1 1 1 1 1 1 1 1 1 1 1 1
symmnumber: 1
zpe: 526310.1 jmol-1
zpe.correction: 0.200461 hartree
zpe.thermalcorrener: 0.215137 hartree
zpe.thermalcorrenthalpy: 0.216081 hartree
zpe.thermalcorrgfe: 0.158429 hartree
zpe.sumelectzpe: -629.242748 hartree
zpe.sumelectthermal: -629.228072 hartree
zpe.sumelectthermalent: -629.227128 hartree
zpe.sumelectthermalfe: -629.284779 hartree
dipole: 0.5272 1.3816 0.0371
dipole: 1.4793
quadrupole: -51.1313 -67.4549 -76.2626
quadrupole: 2.8163 -3.2094 -0.9687
quadrupole: 13.8183 -2.5053 -11.3130 2.8163 -3.2094 -0.9687
hfenergy: -629.4432088 hartree
pointgroup: C01 [X(C7H13N1O4)]
dipole: -0.2128688 0.540867 -0.0292473 debye
dipolederiv: -1.340521 -0.4481887 0.0450954 -0.759083 -0.8611791 -0.0513893 -0.1201218 -0.1103655 -0.4014122 -0.9914784 0.4530359 0.3073027 0.4697517 -0.6513486 -0.0724429 0.3495149 -0.128517 -0.5711785 -0.5594234 0.1516217 0.0664908 0.0109676 -0.5186907 0.2980151 0.1943491 0.0683814 -0.7990403 -0.8871175 0.0390959 0.1262264 0.0887281 -0.7515261 -0.2653048 0.1892644 -0.2330004 -0.5524438 -1.4058781 -0.1190402 0.1767577 -0.079497 -0.4246765 0.0827893 0.2109605 0.095265 -0.4837924 0.8991104 0.2506853 0.0022353 0.1887212 0.1849793 -0.0243859 -0.0850281 -0.1147531 0.3806559 -0.0996452 -0.0651654 -0.0149616 -0.0335242 -0.0084713 0.0095102 0.0608466 -0.0109828 -0.18082 -0.0310194 0.0277954 -0.0200081 -0.0433132 -0.0330794 -0.0463103 -0.0595334 0.0096909 -0.0439934 1.0799098 -0.5667217 -0.3650478 -0.3249939 0.7138412 -0.2099933 -0.5190787 0.0673609 0.9890329 2.2163034 0.2458789 -0.4096113 0.3951783 1.1771905 0.3472787 -0.3864022 0.3915373 0.633376 0.4467014 -0.1656192 -0.0177145 -0.2295967 0.4577519 0.0464052 0.0549551 0.0014616 0.22597 0.445373 0.1424768 0.0357137 0.3672667 0.2527045 -0.1321786 0.1756207 -0.0654755 0.1833469 -0.1124215 -0.0462718 0.0600892 -0.0437846 0.1132507 0.0115722 0.0580284 0.0189375 0.0884317 0.1050943 -0.0385027 -0.0573893 -0.0355077 0.0224392 -0.0969411 -0.0614367 -0.0619875 0.0507923 0.0531953 0.1229443 -0.0403149 0.1034841 -0.0885673 0.080457 -0.0240758 0.036074 0.0511193 -0.1257675 -0.0465535 0.0312424 -0.0155388 0.0899777 -0.0160457 0.0625838 0.0018209 0.0852093 0.0620975 0.0984358 -0.0329071 0.0766416 -0.0946952 0.0344989 -0.0435087 0.038462 0.0792684 0.1103323 0.0011243 0.0291059 -0.0202293 0.0933885 0.0427068 0.0066486 0.0023344 -0.1025244 0.1990859 -0.0506493 0.0282901 -0.0930999 0.1833725 -0.0794733 0.0200239 -0.0953658 0.2938463 -0.0167003 0.060631 0.0967969 0.0369772 0.078293 0.0009241 0.1303877 -0.033712 -0.0021357 -0.017464 -0.0983998 -0.0061866 -0.0011891 -0.0676823 -0.0113844 -0.0261427 0.0320726 0.1015331 0.0233891 0.0331003 -0.0540961 0.0312505 0.0190067 -0.0559372 -0.1444091 0.0141373 -0.0592645 -0.1730379 0.0068477 -0.0852205 0.0430155 0.0315531 0.0755191 -0.1384125 0.0451278 0.0573492 -0.016623 -0.0767116 0.0403107 -0.1331721 0.0406329 0.0838463 0.0936573 0.1141817 -0.098221 0.1365051 0.0881508 0.0578006 0.0005469 0.041535 -0.0517362 0.0013084 -0.0826856 0.0748948 unknown
polarizability: 118.2820211|0.3218363|92.610256|-8.4544339|1.7000493|81.4680156 unknown
InChI: InChI=1S/C7H13NO4/c1-7(2,5(9)11-4)12-6(10)8-3/h8H,1-4H3
charge 0 multiplicity 1
25 atoms
O  -0.821891 1.049332 0.248356
O  2.282092 -0.652584 -0.537195
O  1.031309 -0.801413 1.419321
O  -1.120796 -1.028305 -0.849577
N  -2.847849 0.034988 0.344127
C  0.618034 1.076649 -0.157632
C  0.735698 1.317208 -1.671384
C  1.20012 2.240168 0.671841
C  1.280372 -0.236462 0.333217
C  -1.571365 -0.082563 -0.15035
C  2.997076 -1.888188 -0.132092
C  -3.868768 -0.988881 0.112293
H  1.794181 1.431867 -1.956514
H  0.313159 0.47148 -2.234673
H  0.191267 2.242274 -1.931487
H  2.278181 2.352699 0.463079
H  0.686411 3.178047 0.400645
H  1.056635 2.050519 1.748263
H  -3.048396 0.846275 0.929007
H  3.750864 -2.045149 -0.916052
H  2.286522 -2.729828 -0.086165
H  3.467066 -1.753038 0.856734
H  -4.747702 -0.56871 -0.41084
H  -4.201157 -1.447421 1.062101
H  -3.422864 -1.77376 -0.518922
