program: Gaussian 09
title: 000156103
version: EM64L-G09RevD.01
frameworkgroup: C1[X(C19H20O4)]
method: RPBEPBE
basis: SDD
operation: Freq
keyword: #pfreq=noraman
keyword: PBEPBE/SDD
title: #p freq=noraman PBEPBE/SDD
converged: NO YES NO NO
title: Mulliken charges:
elementType: O O O O C C C C C C C C C C C C C C C C C C C H H H H H H H H H H H H H H H H H H H H
charge: -0.220237 -0.434123 -0.195085 -0.269242 0.234147 -0.406968 -0.138683 -0.119749 -0.259932 -0.167332 0.024337 -0.566350 -0.609661 0.150513 0.171634 -0.599602 0.466870 -0.798911 0.435284 -0.506689 -0.534746 0.102136 -0.816029 0.279541 0.254213 0.267741 0.292458 0.246502 0.223368 0.239719 0.249714 0.236910 0.231371 0.280648 0.222579 0.237802 0.243165 0.356689 0.250429 0.240792 0.245698 0.233683 0.225396
chargesum: 0.00000
title: Mulliken charges with hydrogens summed into heavy atoms:
elementType: O O O O C C C C C C C C C C C C C C C C C C C
charge: -0.220237 -0.077434 -0.195085 -0.269242 0.234147 -0.127427 0.115530 0.147992 0.032526 0.079170 0.024337 -0.103263 -0.123037 0.150513 0.171634 -0.087583 0.466870 -0.095364 0.435284 -0.256260 -0.293954 0.102136 -0.111252
polarizability: 2.66781312e+02 -6.84338079e+00 2.19115034e+02 9.57882854e+00 -4.77594941e+00 1.44888712e+02
1716.lowfreq: -9.8997 -8.2797 -4.0256 -0.0005 0.0003 0.0004 31.8369 52.9924 66.9378
frequency: 31.7768 52.9171 66.9280 109.3384 122.4191 147.9784 156.2363 182.7992 195.1735 208.1338 219.9563 232.5307 243.5445 259.8315 270.9124 297.7936 318.7685 334.3373 354.8967 364.1485 385.0159 396.7399 426.0850 432.4883 442.9969 462.6441 493.8799 504.7301 526.8611 552.4635 582.6026 594.5828 616.5769 624.9062 644.1488 658.2860 665.8303 698.8373 737.3264 792.1111 811.6963 827.3572 830.0866 860.5145 881.8074 894.5261 900.1246 917.7730 926.0152 946.4041 961.3936 972.9397 982.4086 999.8992 1013.5152 1019.4983 1038.5964 1047.0087 1053.2563 1071.6880 1076.9137 1085.7702 1103.6232 1117.3679 1137.4935 1146.8711 1172.1451 1182.4703 1189.5572 1196.6780 1210.9392 1219.1372 1231.2281 1240.6126 1258.4150 1278.6391 1282.2053 1298.4264 1301.3032 1306.9726 1317.1951 1321.0897 1323.0295 1332.5724 1342.4276 1346.8858 1361.4540 1375.9957 1395.1359 1398.7776 1423.1272 1451.8618 1455.7186 1461.4511 1468.3581 1469.5339 1476.9818 1486.7522 1500.7100 1549.1838 1598.6694 1613.7977 1675.9476 2974.4894 2974.9405 2977.5210 2985.8893 2990.6592 2991.3050 2994.6148 3012.5564 3030.2123 3044.5862 3046.7317 3049.9401 3058.5123 3075.3043 3081.2091 3091.1568 3098.7241 3102.0113 3111.5902 3529.5556
redmass: 6.4402 4.2706 4.2164 5.7918 5.5623 1.7923 2.8756 1.8170 3.0802 2.8077 1.9705 2.8185 3.0358 2.0293 2.6634 3.2042 4.9764 4.2698 4.5665 4.3410 3.1066 1.3561 3.8501 5.2801 3.8953 4.9968 4.8322 5.1699 4.2028 4.6607 4.3847 4.0456 4.2770 2.8740 3.6491 4.0620 3.3217 5.0686 5.5611 3.6079 2.6506 3.2859 2.5558 2.8643 2.9786 1.5558 3.6395 2.0580 2.6773 3.6616 2.4336 2.2366 3.1803 2.6205 3.6358 2.0090 1.8146 1.5735 2.2918 2.6370 2.1513 2.2030 2.8429 2.5183 2.6568 2.1804 1.9976 1.2123 1.4921 1.5331 1.9396 1.5682 1.5617 1.6569 1.5418 1.6183 1.4980 1.5431 1.7346 1.5562 2.2260 1.4729 1.3979 1.4129 1.4561 1.6263 1.7352 1.1719 1.1990 1.2060 2.8446 1.1317 1.1518 1.0932 1.0708 1.1712 1.0522 1.0451 4.5137 7.5399 8.2739 6.2260 12.0470 1.0731 1.0529 1.0548 1.0389 1.0616 1.0807 1.0627 1.0910 1.0955 1.0979 1.0865 1.0969 1.1027 1.0987 1.0893 1.0985 1.0979 1.0888 1.0889 1.0657
irintensity: 5.3337 1.6202 2.0243 1.3925 1.8579 2.3500 2.0131 3.7608 1.1718 0.7179 3.2640 4.9298 2.5230 3.0065 1.8456 3.7052 3.7452 3.2251 11.1021 1.6293 6.2038 87.7572 5.9491 1.6030 4.7631 0.9728 0.7919 2.7634 0.9678 0.1088 4.0982 1.1268 2.9446 2.8811 1.8484 6.1796 6.6376 8.4977 2.5915 0.4421 1.1691 18.7671 20.5186 6.8510 26.3397 5.3943 11.9590 39.8693 47.3284 3.9982 5.0146 12.8904 60.8202 7.5965 97.5524 7.9071 0.6711 4.9000 5.4600 10.4851 20.1021 6.3003 4.5700 4.9948 6.9712 11.9075 18.7365 2.8795 4.5572 4.5459 13.8253 14.3127 8.0675 13.0755 14.4563 8.7239 11.3729 2.5570 1.6940 2.5403 8.8488 10.7391 0.9792 9.2970 0.9722 0.9055 2.3256 30.8512 21.0600 18.2652 49.1870 8.5551 14.1602 13.3512 13.8431 4.8811 8.0246 12.3469 198.7918 97.2572 19.6377 47.9918 221.3818 6.2692 1.3257 45.8295 13.8148 14.4423 13.0997 31.6846 10.4957 21.8386 19.3539 23.7738 17.1116 16.2946 35.7849 18.9559 25.2896 13.2193 7.3889 12.8075 13.5891
temp: 298.150 k
press: 1.00000 atm
elementType: 8 8 8 8 6 6 6 6 6 6 6 6 6 6 6 6 6 6 6 6 6 6 6 1 1 1 1 1 1 1 1 1 1 1 1 1 1 1 1 1 1 1 1
symmnumber: 1
zpe: 913773.4 jmol-1
zpe.correction: 0.348038 hartree
zpe.thermalcorrener: 0.367460 hartree
zpe.thermalcorrenthalpy: 0.368404 hartree
zpe.thermalcorrgfe: 0.301776 hartree
zpe.sumelectzpe: -1035.226947 hartree
zpe.sumelectthermal: -1035.207525 hartree
zpe.sumelectthermalent: -1035.206580 hartree
zpe.sumelectthermalfe: -1035.273208 hartree
dipole: -4.4630 2.4634 -3.6352
dipole: 6.2611
quadrupole: -172.6560 -122.6436 -140.9905
quadrupole: 19.0825 9.8426 -0.7007
quadrupole: -27.2260 22.7865 4.4395 19.0825 9.8426 -0.7007
hfenergy: -1035.5749847 hartree
pointgroup: C01 [X(C19H20O4)]
dipole: -1.6963819 0.8180516 -1.5877279 debye
polarizability: 265.648065|-4.349844|217.7587443|16.6051101|-10.0444353|147.3782482 unknown
InChI: InChI=1S/C19H20O4/c1-8-5-11(20)6-10-3-4-19-9(2)16(21)17(23-18(19)22)13-7-12(8)14(10)15(13)19/h5-6,9,13,15-17,21H,3-4,7H2,1-2H3
charge 0 multiplicity 1
43 atoms
O  -1.85687 1.077741 1.325465
O  -4.581905 0.978561 0.27601
O  -1.337428 -0.818993 2.52261
O  5.111649 -1.261748 0.124374
C  -1.538434 -0.993689 0.033782
C  -0.559075 -0.188138 -0.873009
C  -0.977119 1.305216 -1.003877
C  -3.016434 -0.852183 -0.502593
C  -2.188494 1.522975 -0.077315
C  -3.396788 0.674175 -0.532731
C  0.855149 -0.172173 -0.302869
C  -1.006244 -2.439242 0.108402
C  0.292673 2.138565 -0.660541
C  -1.543658 -0.306449 1.409381
C  1.370094 1.121107 -0.278399
C  0.453008 -2.523071 0.62908
C  1.42656 -1.409141 0.19728
C  -3.270669 -1.52835 -1.866746
C  2.710743 1.556139 0.086468
C  2.775679 -1.637176 0.403355
C  3.802842 0.72039 0.269181
C  3.936274 -0.749367 0.214126
C  2.934477 3.058046 0.215592
H  -0.541096 -0.691133 -1.859935
H  -1.313655 1.529742 -2.03292
H  -3.688153 -1.330854 0.237934
H  -2.467226 2.582407 0.039813
H  -3.691646 0.979053 -1.552009
H  -1.059507 -2.872097 -0.9084
H  -1.650412 -3.054812 0.763566
H  0.104286 2.832045 0.182806
H  0.607589 2.766437 -1.516157
H  0.87726 -3.508944 0.364898
H  0.418803 -2.481077 1.735083
H  -2.616092 -1.126644 -2.662301
H  -3.124148 -2.620981 -1.82189
H  -4.316827 -1.348033 -2.173172
H  -4.329569 0.928428 1.235471
H  3.076792 -2.64125 0.737255
H  4.772727 1.199019 0.466768
H  3.978598 3.283797 0.484483
H  2.279784 3.49161 0.995478
H  2.704063 3.587692 -0.728399
