program: Gaussian 09
title: 000156046
version: EM64L-G09RevD.01
frameworkgroup: C1[X(C10H18N2)]
method: RPBEPBE
basis: SDD
operation: Freq
keyword: #pfreq=noraman
keyword: PBEPBE/SDD
title: #p freq=noraman PBEPBE/SDD
converged: YES YES NO NO
title: Mulliken charges:
elementType: N N C C C C C C C C C C H H H H H H H H H H H H H H H H H H
charge: -0.370285 -0.588065 -0.111925 -0.173493 -0.083391 -0.090359 -0.017201 -0.471454 -0.451034 -0.470271 -0.445906 -0.454142 0.231671 0.181703 0.189193 0.189412 0.186541 0.193870 0.195170 0.214182 0.182831 0.198034 0.192901 0.184321 0.212789 0.190435 0.192307 0.239439 0.260611 0.292115
chargesum: 0.00000
title: Mulliken charges with hydrogens summed into heavy atoms:
elementType: N N C C C C C C C C C C
charge: -0.130847 -0.035339 0.119747 0.008210 0.105802 0.099053 0.169339 -0.082413 -0.054021 -0.079335 -0.048796 -0.071400
polarizability: 1.21763380e+02 -2.18986899e+00 1.04949583e+02 8.47407740e-01 -3.94561865e-01 1.04277630e+02
1716.lowfreq: -0.0003 0.0003 0.0005 17.0770 30.3219 45.0599 86.5647 151.1557 214.2059
frequency: 86.1118 151.0013 214.2015 284.2545 306.9378 322.2902 336.0709 378.1237 405.7690 419.3470 426.9723 430.7171 486.2440 548.7577 629.6371 635.2422 663.6499 739.7062 760.8462 797.5493 809.5037 817.7451 866.8424 873.3058 899.8142 916.3755 937.6384 964.2706 978.5569 1011.7450 1042.5259 1050.9396 1058.2597 1075.1606 1089.0338 1099.7295 1101.3698 1109.3840 1112.6716 1118.0431 1148.3251 1182.4608 1207.7406 1221.1037 1251.1119 1272.1902 1292.3645 1295.1541 1299.9984 1305.3762 1315.1467 1325.0711 1326.9735 1337.7192 1342.1750 1353.0092 1358.5367 1367.9147 1372.6281 1450.4756 1457.3357 1459.2810 1465.0720 1468.8497 1479.7564 1645.2653 2839.8096 2941.8585 2956.6730 2960.4498 2963.6762 2970.7411 2974.5943 2989.8320 2998.2002 3013.4598 3019.6274 3019.9707 3022.5361 3037.6363 3042.7202 3317.3987 3401.4603 3587.2329
redmass: 3.3198 3.0806 2.6450 2.3918 1.8232 1.5547 2.9637 1.8750 2.4946 1.9369 1.5156 1.7077 4.2227 2.7831 3.7083 3.5558 3.2180 1.8785 3.4950 2.9519 2.6072 2.7456 1.5656 1.5820 2.0807 2.0671 2.0513 2.1444 2.1425 4.0577 2.1386 1.8398 1.9769 1.5867 1.7521 1.5338 1.3821 1.0215 1.0524 1.0322 2.3209 1.2341 1.1490 1.4230 1.7089 1.6266 1.8775 1.9733 2.1216 2.1808 1.4412 1.3276 1.3182 1.4134 1.4328 1.4332 1.4845 1.5207 1.5978 1.0829 1.0867 1.0925 1.0959 1.1765 1.0917 1.0882 1.0821 1.0788 1.0629 1.0615 1.0624 1.0674 1.0651 1.0817 1.0818 1.1027 1.0960 1.0943 1.0993 1.1001 1.0991 1.0742 1.0477 1.0958
irintensity: 3.1525 4.2822 3.2025 10.5608 5.6596 17.5822 2.0658 22.3628 37.3242 52.2836 98.9102 4.2938 6.5160 4.0617 1.2844 5.2695 6.0942 55.1670 9.4253 2.9042 1.0327 1.1301 0.3855 0.7304 1.6030 0.0364 1.3725 7.5642 4.1334 0.6927 1.5127 0.0700 1.3885 4.2094 4.2675 10.0508 3.0177 0.3706 0.1150 0.7470 1.7176 0.2164 0.4734 5.7539 0.0965 0.4994 0.2505 0.3071 0.3507 0.2701 0.5910 0.1152 0.0806 0.5810 0.7984 2.7712 2.7854 0.8963 7.8962 0.0983 4.9555 25.6129 15.7558 2.5896 7.3316 7.1321 90.7771 41.8044 16.7375 41.9855 39.7486 11.5174 135.6043 171.7963 100.7154 5.2857 14.0024 98.6938 59.8958 24.4432 49.3899 21.0605 23.8868 2.6520
temp: 298.150 k
press: 1.00000 atm
elementType: 7 7 6 6 6 6 6 6 6 6 6 6 1 1 1 1 1 1 1 1 1 1 1 1 1 1 1 1 1 1
symmnumber: 1
zpe: 711869.3 jmol-1
zpe.correction: 0.271137 hartree
zpe.thermalcorrener: 0.281197 hartree
zpe.thermalcorrenthalpy: 0.282141 hartree
zpe.thermalcorrgfe: 0.236720 hartree
zpe.sumelectzpe: -500.380679 hartree
zpe.sumelectthermal: -500.370619 hartree
zpe.sumelectthermalent: -500.369675 hartree
zpe.sumelectthermalfe: -500.415096 hartree
dipole: 1.2700 0.8059 -0.9720
dipole: 1.7908
quadrupole: -65.7153 -74.7056 -73.5091
quadrupole: 2.0593 -1.9012 -1.1280
quadrupole: 5.5947 -3.3956 -2.1991 2.0593 -1.9012 -1.1280
hfenergy: -500.6518162 hartree
pointgroup: C01 [X(C10H18N2)]
dipole: -0.4910465 -0.3272142 -0.3849745 debye
polarizability: 121.8411221|-1.9400724|104.8913852|-0.6719221|0.3588464|104.2580863 unknown
InChI: InChI=1S/C10H18N2/c11-12-10-8-2-6-1-7(4-8)5-9(10)3-6/h6-10,12H,1-5,11H2
charge 0 multiplicity 1
30 atoms
N  -2.327653 -0.575787 -0.012634
N  -3.427409 0.328359 -0.05054
C  -0.495793 1.14647 0.12098
C  -0.036232 -1.185144 -0.767028
C  1.795629 0.574103 -0.814944
C  1.043436 -0.420826 1.39757
C  -1.097622 -0.052437 -0.662651
C  0.721263 1.688406 -0.678057
C  -0.034269 0.689769 1.529517
C  1.183963 -0.642501 -1.563256
C  0.42718 -1.632946 0.646584
C  2.259548 0.125379 0.598328
H  -1.277731 1.923426 0.213175
H  -0.475679 -2.050704 -1.309525
H  2.662745 0.960201 -1.387558
H  1.374982 -0.740793 2.405673
H  -1.325664 0.301093 -1.701742
H  1.151714 2.567234 -0.157372
H  0.399521 2.029947 -1.683395
H  -0.904041 0.305775 2.094529
H  0.3762 1.556409 2.086863
H  0.873265 -0.344607 -2.58531
H  1.943297 -1.443068 -1.671481
H  1.174969 -2.44668 0.551039
H  -0.431078 -2.029824 1.220593
H  3.041503 -0.656676 0.51034
H  2.7134 0.982107 1.1368
H  -2.555113 -1.523513 -0.361917
H  -3.985672 0.368719 -0.913095
H  -3.961857 0.359111 0.817915
