program: Gaussian 09
title: 000156013
version: EM64L-G09RevD.01
frameworkgroup: C1[X(C8H16N2O3)]
method: RPBEPBE
basis: SDD
operation: Freq
keyword: #p
keyword: freq=noraman
keyword: PBEPBE/SDD
title: #p freq=noraman PBEPBE/SDD
converged: YES YES NO NO
title: Mulliken charges:
elementType: O O O N N C C C C C C C C H H H H H H H H H H H H H H H H
charge: -0.258429 -0.284612 -0.246646 -0.058332 0.041514 -0.406697 -0.372110 -0.348913 -0.338339 -0.263039 -0.676188 0.292513 -0.752802 0.250728 0.214633 0.218520 0.255374 0.209931 0.241402 0.221017 0.201807 0.222228 0.236674 0.209976 0.217528 0.226485 0.250844 0.248897 0.246038
chargesum: 0.00000
title: Mulliken charges with hydrogens summed into heavy atoms:
elementType: O O O N N C C C C C C C C
charge: -0.258429 -0.284612 -0.246646 -0.058332 0.041514 0.058663 0.101784 0.102419 0.084485 0.195863 -0.022200 0.292513 -0.007023
polarizability: 1.35657978e+02 3.46664951e+00 1.12060266e+02 2.73097672e-01 -4.93185086e+00 9.50471250e+01
1716.lowfreq: -12.4969 -4.7619 0.0006 0.0008 0.0008 5.4465 13.6329 23.5492 29.1143
frequency: -8.6322 23.4935 29.0739 57.6415 64.0436 72.9523 87.8523 108.8149 123.0697 187.9319 197.6202 227.4339 242.3870 284.9069 310.7182 341.0557 366.9121 394.9496 451.3629 499.4128 568.7236 616.3795 677.4216 749.6932 757.6576 814.1270 843.0845 867.9749 870.1474 896.9560 954.0128 999.6852 1005.9427 1038.4958 1044.8275 1047.7585 1086.9370 1091.5835 1109.5592 1162.2124 1199.8806 1201.4532 1239.1186 1261.5641 1270.5844 1281.5647 1301.6926 1306.0063 1331.5174 1346.8713 1359.8058 1366.7218 1376.7633 1386.2482 1395.7563 1441.2891 1454.3858 1455.7731 1458.8619 1470.4794 1474.9240 1479.2121 1484.2006 1487.4336 1649.0128 2974.4139 2980.0723 2988.6193 2989.1137 2996.9006 3006.1806 3023.6941 3037.4972 3053.1549 3058.7037 3065.2919 3080.1681 3084.5130 3097.8792 3099.9482 3139.9794
redmass: 1.1048 5.4505 3.2474 3.2415 4.3479 2.2060 2.3823 3.6922 2.6762 3.3219 3.8313 1.2416 2.9091 2.9242 3.5405 6.7100 3.1601 3.7742 3.4456 5.3925 3.1290 4.7647 2.9876 1.1042 1.2209 4.2926 1.9159 1.9755 1.6367 1.9158 4.7368 2.2985 2.2811 3.6830 1.6544 3.0874 2.5478 2.0329 2.0819 1.4186 2.2400 2.9547 1.9588 1.4065 1.1992 1.2386 1.4481 1.2415 3.0144 1.3377 1.4395 1.4282 1.4036 1.2944 1.2085 1.0951 1.0590 1.0539 1.0833 1.0801 1.0544 1.0417 1.0885 1.0824 9.8631 1.0635 1.0367 1.0599 1.0605 1.0575 1.0385 1.0599 1.0980 1.1017 1.1052 1.0990 1.1017 1.0994 1.1054 1.0938 1.1026
irintensity: 0.6613 1.7511 1.8143 0.2765 3.2443 2.2342 2.2760 0.2643 1.0919 7.4327 2.2546 1.0442 2.6199 0.8544 10.0727 5.4997 3.3347 4.0092 0.1851 13.5888 3.1633 3.6883 2.6776 6.6377 12.9403 14.8875 8.4166 12.3445 30.8865 6.8413 34.7610 121.6120 99.4689 4.1081 15.4055 2.0769 21.3340 1.7798 0.3986 10.8187 129.3889 282.7095 2.1728 22.3139 5.7654 9.4451 27.9204 13.9348 75.0463 0.6449 0.2759 13.0040 14.6029 38.9394 11.1806 11.7672 19.4352 17.7722 6.5720 1.2921 4.7192 14.7829 13.7689 17.7569 207.6668 18.4079 40.2647 23.5086 36.5288 21.0043 2.7157 22.8733 3.4844 14.0420 2.1490 1.6972 68.4955 36.3391 29.0173 10.9469 9.0354
temp: 298.150 k
press: 1.00000 atm
elementType: 8 8 8 7 7 6 6 6 6 6 6 6 6 1 1 1 1 1 1 1 1 1 1 1 1 1 1 1 1
symmnumber: 1
zpe: 630623.8 jmol-1
zpe.correction: 0.240192 hartree
zpe.thermalcorrener: 0.255379 hartree
zpe.thermalcorrenthalpy: 0.256323 hartree
zpe.thermalcorrgfe: 0.195004 hartree
zpe.sumelectzpe: -648.511725 hartree
zpe.sumelectthermal: -648.496537 hartree
zpe.sumelectthermalent: -648.495593 hartree
zpe.sumelectthermalfe: -648.556913 hartree
dipole: -1.2614 -4.4066 0.4070
dipole: 4.6016
quadrupole: -78.0684 -88.1257 -80.4813
quadrupole: 8.0631 -14.6193 4.6497
quadrupole: 4.1567 -5.9005 1.7438 8.0631 -14.6193 4.6497
hfenergy: -648.7519165 hartree
pointgroup: C01 [X(C8H16N2O3)]
dipole: -0.4409898 -1.7375362 0.2530297 debye
polarizability: 135.3471134|3.6406005|111.8490614|-2.3817201|-5.7878881|95.5691937 unknown
InChI: InChI=1S/C8H16N2O3/c1-3-5-10(9-12)6-4-7-13-8(2)11/h3-7H2,1-2H3
charge 0 multiplicity 1
29 atoms
O  2.63551 -0.285447 -0.592619
O  -1.63058 2.68334 -0.63742
O  4.383811 -0.051704 0.930213
N  -2.12644 0.710429 0.318118
N  -2.543826 1.793086 -0.439277
C  -0.757339 0.640502 0.872657
C  0.296586 0.168359 -0.161298
C  -3.153428 -0.313692 0.582794
C  -2.854061 -1.687497 -0.061167
C  1.694917 0.19742 0.458224
C  -3.988027 -2.694912 0.225222
C  3.985263 -0.348412 -0.218677
C  4.844647 -0.78362 -1.385129
H  -0.494557 1.66083 1.214936
H  -0.783453 -0.034298 1.747571
H  0.066619 -0.856063 -0.504853
H  0.268223 0.835918 -1.039374
H  -3.271624 -0.435502 1.678909
H  -4.098495 0.095557 0.18306
H  -2.728217 -1.55408 -1.152373
H  -1.897818 -2.087627 0.329127
H  1.782802 -0.463175 1.341693
H  1.99625 1.217522 0.760924
H  -4.120774 -2.853363 1.312062
H  -4.951441 -2.339375 -0.18476
H  -3.768932 -3.675741 -0.23249
H  5.188515 0.110447 -1.93715
H  4.276262 -1.417584 -2.082403
H  5.732908 -1.316117 -1.012221
