program: Gaussian 09
title: 000155999
version: EM64L-G09RevD.01
frameworkgroup: C1[X(C14H12O)]
method: RPBEPBE
basis: SDD
operation: Freq
keyword: #pfreq=noraman
keyword: PBEPBE/SDD
title: #p freq=noraman PBEPBE/SDD
converged: YES YES NO NO
title: Mulliken charges:
elementType: O C C C C C C C C C C C C C C H H H H H H H H H H H H
charge: -0.259273 -0.366401 0.324326 0.284129 0.144541 0.179774 -0.416004 -0.398690 -0.390467 -0.396151 -0.236028 -0.254951 -0.231160 -0.228958 -0.504435 0.216345 0.256817 0.239395 0.239215 0.240161 0.226388 0.226864 0.225907 0.227150 0.235623 0.221260 0.194624
chargesum: 0.00000
title: Mulliken charges with hydrogens summed into heavy atoms:
elementType: O C C C C C C C C C C C C C C
charge: -0.259273 -0.150056 0.324326 0.284129 0.144541 0.179774 -0.159187 -0.159295 -0.151252 -0.155990 -0.009640 -0.028087 -0.005253 -0.001808 0.147072
polarizability: 2.21799901e+02 -4.73041307e+00 1.67885835e+02 2.19887968e+00 1.19044748e+01 7.21125094e+01
1716.lowfreq: -7.7167 -6.6199 0.0006 0.0006 0.0007 7.6464 55.2613 98.0711 114.9840
frequency: 55.2151 98.0610 114.9703 122.2274 182.1137 198.4554 232.4446 292.2140 328.4898 359.6947 406.0026 426.0521 444.2484 506.5389 518.1165 565.7714 602.0572 619.6169 655.0924 718.1064 743.9777 745.7539 755.6611 788.7827 838.0894 853.9780 883.0531 884.2283 898.1030 948.6518 952.9201 985.4763 987.5364 996.4278 1021.8133 1030.9876 1035.6842 1095.1012 1106.4872 1108.9491 1143.1705 1163.2829 1168.7883 1175.6813 1182.8997 1208.1173 1242.8863 1287.1308 1298.7462 1305.5385 1376.3751 1404.9908 1427.6024 1439.1334 1445.3320 1454.5182 1466.6038 1483.6804 1485.7482 1593.0174 1597.9399 1617.5888 1622.6447 2913.7800 2929.5579 3018.9123 3097.6695 3123.3722 3124.5327 3132.1677 3136.3785 3144.5457 3149.0660 3161.9695 3164.0650
redmass: 3.4002 3.0124 3.6412 3.5868 4.0282 3.2931 1.3751 4.0092 3.8485 4.4050 5.6310 3.3495 3.1131 5.0847 4.3866 3.3666 4.9485 6.4839 5.1496 4.6939 2.2227 2.4192 1.5154 2.0948 3.1435 2.3955 2.1667 1.6169 3.4669 1.4341 1.4761 1.3345 1.3308 6.2926 2.2849 2.0236 8.3048 2.0916 1.6053 1.3458 1.3660 1.3103 1.2671 1.2071 1.8423 1.8947 1.9252 1.2759 1.7222 1.6555 8.7321 3.4390 1.1352 2.1916 2.7434 1.0641 2.6158 1.0776 3.9750 6.6087 6.9556 7.1628 7.4290 1.0821 1.0365 1.0986 1.0982 1.0851 1.0853 1.0894 1.0898 1.0947 1.0949 1.1003 1.1002
irintensity: 1.1916 4.7748 3.2522 1.1294 1.5370 0.9666 2.1096 0.5813 0.7697 2.7415 0.5704 6.4164 0.0512 0.1501 1.0673 0.1144 1.6338 7.8405 6.5959 4.4210 26.7408 10.6641 150.9646 0.2781 4.7787 1.5830 1.7230 1.2624 10.4972 0.5032 2.1219 0.0356 0.1650 4.3301 4.0948 6.0033 102.0221 3.0207 1.2731 1.0074 4.7013 1.0624 5.4718 0.7864 11.0200 1.6538 0.6396 16.8506 0.9804 4.2792 6.8527 1.5318 3.5971 30.6643 9.1879 8.7972 6.3926 15.6502 0.3879 0.6337 0.9207 6.3216 4.3177 41.3166 78.9948 55.7979 31.8434 3.6396 0.7610 5.1239 5.1103 27.8926 32.2279 45.0140 21.9655
temp: 298.150 k
press: 1.00000 atm
elementType: 8 6 6 6 6 6 6 6 6 6 6 6 6 6 6 1 1 1 1 1 1 1 1 1 1 1 1
symmnumber: 1
zpe: 566997.5 jmol-1
zpe.correction: 0.215958 hartree
zpe.thermalcorrener: 0.227869 hartree
zpe.thermalcorrenthalpy: 0.228813 hartree
zpe.thermalcorrgfe: 0.177820 hartree
zpe.sumelectzpe: -614.862103 hartree
zpe.sumelectthermal: -614.850192 hartree
zpe.sumelectthermalent: -614.849248 hartree
zpe.sumelectthermalfe: -614.900241 hartree
dipole: 1.1078 0.0970 1.0512
dipole: 1.5303
quadrupole: -74.9340 -75.0344 -93.1200
quadrupole: 3.7477 0.0743 4.9932
quadrupole: 6.0955 5.9951 -12.0905 3.7477 0.0743 4.9932
hfenergy: -615.0780608 hartree
pointgroup: C01 [X(C14H12O1)]
dipole: -0.4341761 0.0342126 -0.4156864 debye
polarizability: 221.7175102|5.1165052|167.8666299|2.9362151|-12.1775197|72.2141062 unknown
InChI: InChI=1S/C14H12O/c1-15-14-12-8-4-2-6-10(12)11-7-3-5-9-13(11)14/h2-9,14H,1H3
charge 0 multiplicity 1
27 atoms
O  -0.155306 2.438541 0.54849
C  -0.144566 1.343205 -0.445609
C  1.157207 0.570915 -0.259507
C  -1.209396 0.251431 -0.259938
C  0.887894 -0.798077 0.026175
C  -0.578203 -0.997126 0.029591
C  2.472253 1.055264 -0.305969
C  -2.608126 0.328167 -0.375773
C  1.947365 -1.702689 0.246759
C  -1.346686 -2.161364 0.233816
C  3.539524 0.147593 -0.080717
C  -3.383941 -0.841116 -0.160468
C  3.276882 -1.21828 0.189092
C  -2.757265 -2.072545 0.145987
C  -1.297469 3.345177 0.423195
H  -0.224757 1.797926 -1.460715
H  2.670069 2.114679 -0.498757
H  -3.106154 1.266602 -0.642631
H  1.753962 -2.759528 0.462376
H  -0.866996 -3.122853 0.44879
H  4.575068 0.504191 -0.11258
H  -4.475608 -0.792127 -0.240511
H  4.113167 -1.905942 0.358957
H  -3.369701 -2.96723 0.305062
H  -1.047829 4.227219 1.034471
H  -2.22914 2.887676 0.810238
H  -1.455049 3.658993 -0.631923
