program: Gaussian 09
title: 000014217
version: EM64L-G09RevD.01
frameworkgroup: C1[X(C4H6OS)]
method: RPBEPBE
basis: SDD
operation: Freq
keyword: #pfreq=noraman
keyword: PBEPBE/SDD
title: #p freq=noraman PBEPBE/SDD
converged: NO YES NO NO
title: Mulliken charges:
elementType: S O C C C C H H H H H H
charge: 0.634310 -0.625470 -0.350304 -0.350254 -0.424765 -0.424803 0.252365 0.252368 0.235375 0.282905 0.235381 0.282893
chargesum: 0.00000
title: Mulliken charges with hydrogens summed into heavy atoms:
elementType: S O C C C C
charge: 0.634310 -0.625470 -0.097939 -0.097886 0.093515 0.093470
polarizability: 8.31714464e+01 1.92503662e-03 5.82577559e+01 1.93238772e-03 9.32478032e+00 5.20280512e+01
1716.lowfreq: -8.6870 -0.0007 0.0018 0.0033 11.4218 16.0884 94.6213 151.1766 187.6266
frequency: 94.6173 151.1660 187.6262 238.8183 267.6123 428.7792 447.5743 499.5224 533.4034 560.8788 659.0288 791.7914 916.3033 926.2560 945.0760 958.5414 987.8006 994.8471 1188.5612 1209.0401 1359.6283 1362.7056 1602.2880 1611.7662 3062.9152 3064.1969 3167.1559 3169.3675 3201.5766 3202.4905
redmass: 3.6690 2.1486 2.9274 4.5827 2.8462 3.1868 4.8901 9.5633 3.3346 1.3417 1.7596 15.2309 1.1541 1.1632 1.2037 1.2552 1.2130 1.2033 1.3040 1.3058 1.1447 1.1436 4.8602 4.8417 1.0605 1.0604 1.0990 1.0992 1.1142 1.1140
irintensity: 0.9906 0.9933 3.2103 11.4735 4.3483 1.2400 1.2683 2.5165 3.1239 20.6920 87.1050 24.2999 8.8562 1.7443 13.8215 0.3784 67.6767 115.7883 33.9848 11.7248 7.8224 42.9869 28.2419 7.0673 5.3626 4.3754 4.5381 4.5676 2.7811 1.3627
temp: 298.150 k
press: 1.00000 atm
elementType: 16 8 6 6 6 6 1 1 1 1 1 1
symmnumber: 1
zpe: 226042.4 jmol-1
zpe.correction: 0.086095 hartree
zpe.thermalcorrener: 0.093548 hartree
zpe.thermalcorrenthalpy: 0.094492 hartree
zpe.thermalcorrgfe: 0.054685 hartree
zpe.sumelectzpe: -628.696871 hartree
zpe.sumelectthermal: -628.689418 hartree
zpe.sumelectthermalent: -628.688474 hartree
zpe.sumelectthermalfe: -628.728281 hartree
dipole: 0.0002 -3.9800 -0.5792
dipole: 4.0220
quadrupole: -37.6182 -46.5690 -42.1254
quadrupole: 0.0016 0.0004 1.6387
quadrupole: 4.4860 -4.4648 -0.0213 0.0016 0.0004 1.6387
hfenergy: -628.7829662 hartree
pointgroup: C01 [X(C4H6O1S1)]
dipole: -0.0003248 -1.5448373 -0.3425777 debye
dipolederiv: 0.3702542 0.0000513 0.0000319 0.0000177 0.5338652 0.4607774 -0.0000876 0.1123077 0.4295657 -0.4647006 -0.0000236 -0.0000631 -0.0000004 -0.5392207 -0.3369571 0.0000954 0.0590567 -0.3795491 0.1305843 -0.12461 -0.2749934 -0.0978304 -0.0574633 -0.0808782 -0.2550889 -0.021811 -0.217277 0.1306981 0.1245174 0.2750128 0.0977052 -0.0574752 -0.0808496 0.2552251 -0.0217722 -0.2172791 -0.3270987 -0.0382613 -0.0609169 0.0062455 -0.0749312 -0.0245389 -0.003342 -0.0444269 -0.223626 -0.3270195 0.0382098 0.0610453 -0.006334 -0.0748611 -0.0244137 0.0031652 -0.0443316 -0.223813 0.0296412 0.0654782 0.0994748 0.0833103 -0.0489092 0.0257036 0.1390968 0.0048433 0.1256145 0.0295888 -0.0654457 -0.0995115 -0.0832448 -0.0489193 0.0256326 -0.139107 0.0048021 0.1256544 0.0146854 0.0754489 0.1190598 0.0245354 0.132697 -0.0086178 0.1283982 -0.0241608 0.1338892 0.1994123 0.046981 0.0159425 0.0038174 0.0512828 0.0264227 0.0051355 -0.0001412 0.1563838 0.0145722 -0.075403 -0.1190915 -0.0244374 0.132701 -0.0086232 -0.1283329 -0.0241353 0.1340005 0.1993824 -0.0469428 -0.0159907 -0.0037845 0.051234 0.0263423 -0.0051578 -0.0002311 0.156436 unknown
polarizability: 83.1714453|-0.005496|63.6603518|-0.0009692|-4.9098806|46.6254565 unknown
InChI: InChI=1S/C4H6OS/c1-3-6(5)4-2/h3-4H,1-2H2
charge 0 multiplicity 1
12 atoms
S  0.000076 -0.061382 1.171495
O  0.000294 1.524064 0.628352
C  1.420848 -0.876347 0.179604
C  -1.420838 -0.876069 0.179467
C  2.161813 -0.054704 -0.583128
C  -2.162014 -0.054147 -0.582747
H  1.548851 -1.947391 0.361558
H  -1.548738 -1.94719 0.361039
H  3.019623 -0.418755 -1.158347
H  1.892211 1.011625 -0.631768
H  -3.019986 -0.417974 -1.157865
H  -1.892639 1.012272 -0.630758
