program: Gaussian 09
title: 000156185
version: EM64L-G09RevD.01
frameworkgroup: C1[X(C20H23NO5)]
method: RPBEPBE
basis: SDD
operation: Freq
keyword: #p
keyword: freq=noraman
keyword: PBEPBE/SDD
title: #p freq=noraman PBEPBE/SDD
converged: YES YES NO NO
title: Mulliken charges:
elementType: O O O O O N C C C C C C C C C C C C C C C C C C C C H H H H H H H H H H H H H H H H H H H H H H H
charge: -0.440678 -0.407571 -0.331573 -0.287499 -0.303024 -0.151532 -0.158323 0.109713 -0.690541 0.397961 -0.478417 -0.273408 0.116932 0.423814 0.083989 -0.594128 -0.014632 -0.640350 0.215018 0.095157 -0.498139 0.190772 -0.369027 -0.520867 -0.532218 -0.529594 0.216332 0.244120 0.229018 0.200156 0.241158 0.229321 0.257556 0.229989 0.194452 0.231862 0.239081 0.341230 0.248834 0.380962 0.240719 0.225462 0.231650 0.227274 0.251912 0.219434 0.221827 0.223171 0.262644
chargesum: 0.00000
title: Mulliken charges with hydrogens summed into heavy atoms:
elementType: O O O O O N C C C C C C C C C C C C C C C C C C C C
charge: -0.099447 -0.026609 -0.331573 -0.287499 -0.303024 -0.151532 0.058009 0.109713 -0.217403 0.397961 -0.037103 -0.044087 0.116932 0.423814 0.083989 -0.336572 -0.014632 0.015953 0.215018 0.095157 -0.259058 0.190772 -0.120193 0.176964 0.166402 0.178049
polarizability: 3.14874350e+02 -8.67389206e+00 2.82544996e+02 -7.11545949e+00 1.17936674e+01 1.55861773e+02
1716.lowfreq: -5.3581 -3.0019 -0.0002 0.0007 0.0009 6.6613 41.6950 46.5598 50.9796
frequency: 41.6724 46.5265 50.9575 67.0332 90.3585 105.5702 109.2682 116.9052 119.8553 131.5328 152.1584 163.4804 171.3330 174.2493 186.7366 199.0116 211.1029 226.3154 247.2875 257.4036 271.5598 295.9956 319.9025 322.8221 332.6790 342.1829 349.3609 375.8544 390.7466 412.2402 421.9846 445.5357 462.0724 471.9218 483.5771 498.3032 516.8158 531.0154 544.6873 578.0876 587.0097 604.5844 627.0780 652.9772 662.3376 684.6748 718.2789 747.5074 749.5240 768.1679 781.6096 796.5167 825.6353 847.8433 856.1359 867.8864 904.7112 922.1737 934.3651 942.9944 974.5125 983.1742 1001.4751 1022.2800 1040.8340 1053.8387 1070.5223 1096.7811 1108.9164 1112.2735 1115.6338 1117.7820 1125.8417 1140.3505 1150.5826 1155.1495 1159.5038 1159.9374 1167.6835 1199.3079 1203.3526 1216.1828 1223.5426 1232.6173 1242.6644 1257.4881 1267.2497 1280.6870 1291.2923 1311.2850 1322.1541 1330.5479 1359.6528 1365.8278 1368.5894 1393.2736 1412.8739 1422.5139 1432.5812 1435.5498 1441.4347 1447.9116 1454.6712 1457.0112 1458.0949 1460.8580 1463.3061 1463.9031 1471.6582 1474.3848 1478.2413 1483.5484 1487.7751 1490.0625 1575.6051 1592.1806 1599.6906 1616.7085 2803.3846 2874.1343 2886.5647 2966.5838 2968.7085 2973.4200 2980.3174 3039.6406 3044.6227 3056.8660 3059.4272 3062.3867 3065.4281 3071.8008 3092.8416 3116.3567 3119.5922 3126.3324 3128.7973 3149.2018 3163.9694 3455.1654 3491.4568
redmass: 4.5957 3.9207 3.7633 3.8451 4.1262 3.8911 3.0197 3.8487 3.2235 3.4314 1.8661 1.9567 2.2066 1.4475 1.3874 1.8715 1.8690 2.4034 4.3669 3.3130 3.0580 5.5022 5.0161 4.5621 4.5986 3.9593 4.3370 3.8336 4.2009 4.4238 3.9924 2.8480 3.8146 1.1812 3.3821 3.7154 3.2326 2.0353 3.1565 4.0426 4.4174 4.2326 4.6888 6.0622 5.1066 4.6725 5.9613 5.0553 4.6441 4.1709 4.7755 5.3363 1.5828 1.8240 3.5676 3.7540 5.7643 4.5844 2.1042 1.8412 3.4078 3.5780 3.4357 2.4915 3.7965 2.3632 2.5056 3.5806 1.3210 1.2384 1.2409 1.2554 2.6071 1.3907 1.4442 1.3149 1.4407 1.6221 2.0228 1.5510 1.6337 1.9701 1.5895 1.8944 2.7073 2.0504 2.6719 1.8446 1.8317 1.7429 2.2700 1.8221 2.1422 1.5677 1.6535 2.9757 2.9864 1.4107 1.1677 1.4952 1.4329 1.5465 1.8439 1.2436 1.1275 1.1690 1.0992 1.3537 1.1157 1.2190 1.0597 1.0497 1.1160 2.3536 6.7887 7.7019 8.2283 7.5809 1.0787 1.0606 1.0650 1.0323 1.0305 1.0308 1.0639 1.0751 1.0864 1.1044 1.0905 1.0955 1.1041 1.1037 1.1001 1.1024 1.1033 1.1004 1.0890 1.0912 1.0955 1.0644 1.0643
irintensity: 0.0527 0.2298 6.2292 1.8592 3.1238 2.4167 6.5580 1.3939 2.1947 1.5795 2.3544 3.1717 0.7122 0.2990 0.7055 1.7865 2.6026 5.1939 8.8926 4.5802 3.4190 3.5281 5.7162 2.9862 2.7476 1.8512 4.6748 2.4233 3.2135 0.6836 3.6742 2.2142 10.0213 106.3071 5.5077 1.5246 21.6761 33.3809 26.9537 36.8162 30.9653 20.6189 24.7491 3.9082 4.0720 0.3582 12.6214 14.2361 0.3339 13.3320 2.4301 29.7978 44.1374 15.2885 26.6661 18.6545 19.5679 43.3376 4.0671 0.8764 26.6173 52.2629 46.4122 65.6687 92.4471 11.4176 11.1383 46.6404 1.8961 7.5282 8.2398 0.1637 79.7294 13.1305 7.2097 7.1166 7.2161 52.4240 11.4143 54.5432 51.6900 15.8010 34.0204 42.2155 83.4851 4.3101 76.0535 94.1451 62.4040 4.7523 2.9318 52.6344 16.2261 38.1274 46.4823 127.8986 6.4939 8.0910 2.6861 39.7290 11.9338 69.0360 30.0897 10.6558 17.7523 12.1774 12.4446 18.5440 36.5912 44.8950 1.4620 23.9321 26.4438 17.3177 8.0267 3.3041 14.0790 7.3269 46.4605 56.2094 141.8868 69.7357 75.6482 75.9956 21.0411 33.3412 34.5185 40.7139 29.0838 43.9882 26.7171 23.1681 29.6015 19.0573 27.8568 24.1377 12.9805 6.9965 11.0399 10.9341 101.1744
temp: 298.150 k
press: 1.00000 atm
elementType: 8 8 8 8 8 7 6 6 6 6 6 6 6 6 6 6 6 6 6 6 6 6 6 6 6 6 1 1 1 1 1 1 1 1 1 1 1 1 1 1 1 1 1 1 1 1 1 1 1
symmnumber: 1
zpe: 1032727.0 jmol-1
zpe.correction: 0.393345 hartree
zpe.thermalcorrener: 0.418132 hartree
zpe.thermalcorrenthalpy: 0.419076 hartree
zpe.thermalcorrgfe: 0.340528 hartree
zpe.sumelectzpe: -1204.814764 hartree
zpe.sumelectthermal: -1204.789977 hartree
zpe.sumelectthermalent: -1204.789033 hartree
zpe.sumelectthermalfe: -1204.867581 hartree
dipole: -0.3606 1.0430 1.6343
dipole: 1.9720
quadrupole: -157.8278 -123.8994 -149.0312
quadrupole: 1.4792 -5.9390 1.1001
quadrupole: -14.2417 19.6867 -5.4451 1.4792 -5.9390 1.1001
hfenergy: -1205.2081092 hartree
pointgroup: C01 [X(C20H23N1O5)]
dipole: 0.1151989 -0.43142 0.6344549 debye
polarizability: 313.6830594|-10.6501324|284.1526557|6.6290923|-9.5532535|155.4454041 unknown
InChI: InChI=1S/C20H23NO5/c1-21-9-13(22)11-8-15(25-3)19(23)18-16-10(7-12(21)17(11)18)5-6-14(24-2)20(16)26-4/h5-6,8,12-13,22-23H,7,9H2,1-4H3
charge 0 multiplicity 1
49 atoms
O  4.605572 0.031211 -0.579334
O  -1.272183 -2.310731 -0.828202
O  0.765207 -3.935835 -0.466015
O  -2.734778 -0.944424 0.970904
O  -4.905375 0.833045 0.296309
N  2.811535 2.15881 0.257749
C  1.389428 1.717611 0.303047
C  1.278372 0.190024 0.239538
C  0.544584 2.283755 -0.870864
C  2.410227 -0.642287 0.363531
C  3.625621 1.37391 1.225818
C  3.776815 -0.040273 0.64802
C  -0.01544 -0.360156 -0.044338
C  -0.907029 1.880864 -0.664382
C  -1.169299 0.566277 -0.165404
C  2.28544 -2.044662 0.183383
C  -0.105693 -1.745381 -0.320314
C  2.975968 3.617392 0.440679
C  1.04366 -2.580321 -0.174782
C  -2.493676 0.245559 0.246739
C  -1.966907 2.789515 -0.864835
C  -3.565334 1.142574 -0.040376
C  -3.300251 2.409693 -0.595249
C  1.882297 -4.879221 -0.419885
C  -3.218531 -0.709623 2.35308
C  -5.434199 -0.397042 -0.341418
H  0.917162 2.076226 1.258595
H  0.958913 1.878807 -1.816065
H  0.613167 3.383932 -0.918434
H  3.165461 1.344799 2.244322
H  4.623555 1.838519 1.304899
H  4.360792 -0.686427 1.326413
H  3.176267 -2.674168 0.273844
H  4.052619 3.8597 0.447769
H  2.527063 3.989545 1.394535
H  2.515795 4.170711 -0.394592
H  -1.751715 3.795942 -1.241414
H  4.189129 0.762545 -1.115964
H  -4.142023 3.084352 -0.779556
H  -1.116814 -3.288319 -0.931825
H  1.456264 -5.854679 -0.696963
H  2.311249 -4.933374 0.599047
H  2.670614 -4.592295 -1.141639
H  -3.364437 -1.713865 2.780037
H  -4.169494 -0.14659 2.352391
H  -2.454835 -0.160331 2.935914
H  -5.479455 -0.26195 -1.438631
H  -6.449752 -0.522082 0.064785
H  -4.803354 -1.269782 -0.096666
