program: Gaussian 09
title: 000155965
version: EM64L-G09RevD.01
frameworkgroup: C1[X(C10H13NO2)]
method: RPBEPBE
basis: SDD
operation: Freq
keyword: #p
keyword: freq=noraman
keyword: PBEPBE/SDD
title: #p freq=noraman PBEPBE/SDD
converged: YES YES NO NO
title: Mulliken charges:
elementType: O O N C C C C C C C C C C H H H H H H H H H H H H H
charge: -0.372273 -0.193442 -0.542896 0.531032 -0.567829 -0.518389 0.223173 -0.401009 -0.389688 0.159747 -0.403666 0.108242 -0.801093 0.199883 0.201832 0.251281 0.221035 0.222274 0.237534 0.217090 0.266633 0.266178 0.234766 0.234943 0.262530 0.352112
chargesum: 0.00000
title: Mulliken charges with hydrogens summed into heavy atoms:
elementType: O O N C C C C C C C C C C
charge: -0.020161 -0.193442 -0.010085 0.531032 -0.166115 -0.267107 0.223173 0.042299 -0.152154 0.159747 -0.186576 0.108242 -0.068854
polarizability: 1.73736036e+02 5.39353328e-01 1.38120359e+02 -9.82987656e+00 3.03168711e+00 6.92687244e+01
1716.lowfreq: -17.2444 -9.8435 -2.4880 0.0004 0.0004 0.0007 5.7400 17.3512 71.6610
frequency: -6.6145 15.1489 71.6322 87.1512 117.0493 179.0130 190.6813 202.3372 258.0973 298.3150 304.4474 355.2355 371.1080 381.5606 414.5287 428.5724 476.3956 507.7340 542.6897 564.3082 602.2790 633.1421 698.7229 740.1995 762.7850 772.6182 812.3439 889.7265 903.6241 939.7439 944.0903 945.3800 986.5792 1020.9176 1056.5646 1080.5361 1098.9857 1120.5613 1170.8569 1204.1759 1249.0787 1260.1862 1264.5581 1279.9404 1303.2600 1327.0358 1344.1603 1365.4331 1395.6741 1402.3552 1451.5254 1459.3469 1466.6857 1474.7336 1493.6913 1572.9150 1604.5652 1619.9091 1643.6544 2975.9259 2982.8861 2992.2356 3026.3713 3058.2491 3069.2879 3105.9615 3123.0631 3135.7772 3147.8135 3468.9563 3527.7493 3596.0261
redmass: 4.0912 3.6740 5.1969 1.8368 3.8765 1.0638 3.6349 4.6662 1.1541 3.4129 3.1807 3.0236 4.4643 8.8736 1.3800 2.1958 3.1572 2.7766 2.3467 2.2077 4.1922 3.1743 5.2379 3.2556 1.2260 3.8136 1.5592 2.7637 1.9468 1.7814 1.5163 1.4238 4.6051 1.8283 2.2862 1.3366 4.2359 1.4987 1.2051 1.9299 3.3102 1.6874 1.4208 2.1911 1.4447 1.1703 1.2153 1.2310 6.3816 3.1160 1.0926 1.0962 1.0505 1.0980 2.7648 6.4403 7.2119 6.5848 1.0924 1.0592 1.0374 1.0603 1.1019 1.1064 1.0976 1.0877 1.0988 1.0959 1.0905 1.0445 1.0655 1.0982
irintensity: 5.8082 3.9505 0.8265 1.7164 1.6848 1.0837 0.9708 1.2677 56.7872 9.3110 7.8541 2.3518 1.2701 7.1931 90.7105 30.4041 13.4725 7.3625 119.8518 283.1013 20.1375 16.4075 0.4593 0.1827 2.3121 12.2456 36.8493 10.0583 6.7995 19.7960 4.9469 2.6393 52.5413 2.1622 24.1930 27.7998 46.0236 114.8810 28.6723 64.5577 73.6610 51.2025 12.3006 61.6848 42.7169 0.7382 10.4020 48.3518 14.4921 22.9957 32.8270 1.3767 19.3906 11.1373 37.5564 154.4986 50.7842 43.6058 40.2069 23.9734 5.3665 59.5838 1.5480 45.2144 15.5502 17.0958 16.8637 20.1433 5.3579 2.2157 25.8314 0.8537
temp: 298.150 k
press: 1.00000 atm
elementType: 8 8 7 6 6 6 6 6 6 6 6 6 6 1 1 1 1 1 1 1 1 1 1 1 1 1
symmnumber: 1
zpe: 552309.0 jmol-1
zpe.correction: 0.210363 hartree
zpe.thermalcorrener: 0.223202 hartree
zpe.thermalcorrenthalpy: 0.224147 hartree
zpe.thermalcorrgfe: 0.170146 hartree
zpe.sumelectzpe: -593.070627 hartree
zpe.sumelectthermal: -593.057788 hartree
zpe.sumelectthermalent: -593.056844 hartree
zpe.sumelectthermalfe: -593.110844 hartree
dipole: -4.3080 -1.6584 1.7403
dipole: 4.9334
quadrupole: -92.5673 -59.6039 -82.0691
quadrupole: -4.9830 -6.3929 3.3042
quadrupole: -14.4872 18.4762 -3.9890 -4.9830 -6.3929 3.3042
hfenergy: -593.2809901 hartree
pointgroup: C01 [X(C10H13N1O2)]
dipole: 1.694206 -0.6398327 -0.6982164 debye
dipolederiv: -1.0792181 -0.6563799 0.1667531 -0.4836132 -0.265333 0.0685006 0.183645 0.115896 -0.4098873 -1.0001517 0.206155 0.0984508 0.0858244 -0.532859 0.0130153 0.128469 -0.0183289 -0.3216013 -1.0133265 -0.2526642 -0.2444584 -0.2945136 -0.2399614 -0.0891084 -0.4132217 -0.1248527 -0.6453023 0.3025614 0.2227414 -0.0340238 0.2814775 -0.3545933 -0.0066207 -0.1566512 -0.0393205 -0.1156329 -0.2704728 -0.1323969 -0.0783852 -0.1518268 0.1017405 -0.0272682 -0.4042397 -0.1047713 0.0113244 0.1215595 -0.3332711 -0.0367742 0.0507539 0.0876877 -0.0282574 -0.0352279 0.0513088 -0.1267681 -0.5160666 0.3965414 0.047386 0.1737987 -0.5657859 0.0227779 0.0878261 -0.020974 -0.0236978 0.804061 0.1832924 0.1101851 0.2111036 0.2492953 0.0358971 0.3504042 0.0882308 0.3441328 0.0034422 0.153868 -0.0582122 -0.1373665 0.2433118 -0.0214903 0.0109532 -0.0616751 -0.1090585 0.9798142 0.6548001 -0.220536 0.263671 0.3084263 -0.0690326 -0.2051423 -0.149146 0.1269352 -0.37695 -0.2432878 0.0518597 0.173253 0.1110392 -0.0532084 0.0283243 0.023023 -0.1893946 1.2018955 -0.424318 -0.1474585 -0.4353116 1.3477171 -0.0601046 -0.1692635 -0.0346582 0.1523333 -0.0387672 -0.1373533 0.030515 -0.0081494 -0.5137248 0.0633494 0.02059 0.0806735 0.0471588 -0.0558599 0.0418127 0.0766258 0.1010254 -0.0416942 -0.1084344 0.0731666 -0.0489805 -0.0001912 0.0180116 0.0136791 -0.0076981 -0.0576432 -0.0928419 0.1323822 0.0287305 0.077994 -0.0066715 0.1147138 -0.0639075 0.0156255 -0.0530577 -0.0611156 0.0282435 0.0055113 0.0300102 0.1129636 0.0437647 -0.0315793 -0.0100982 -0.0373248 -0.0958008 0.1250754 -0.0203653 0.0690539 -0.0120455 -0.039973 0.0720511 0.0639772 0.0839638 -0.0214523 -0.1028343 0.0244701 -0.0667741 -0.0050299 -0.0277264 0.1114905 0.0294812 0.0987704 0.017565 -0.0045232 0.0213886 -0.0112299 0.1311024 0.0328653 -0.0917276 0.0308542 -0.056969 -0.1128043 0.0326507 0.0328768 0.0424844 0.1566798 0.189757 0.0619282 0.0349263 0.044397 0.1032395 0.111889 0.1592724 0.2042039 0.2245835 0.2081207 0.0137064 0.0948309 0.0429545 0.0817813 -0.0633396 0.2548864 -0.0749316 0.2333949 0.0768909 -0.0264524 0.0943025 -0.0135077 0.0781918 -0.0148577 0.0821694 0.0240542 -0.0710148 -0.0034266 -0.0577101 -0.1114407 -0.030237 0.0743058 0.0016885 -0.1055405 -0.0275611 0.0106651 -0.0410543 0.1389468 0.0160808 0.0680176 0.0228617 -0.0033968 0.0244363 -0.0181357 0.1155731 0.3655351 0.180035 -0.0127689 0.0805098 0.0708036 0.0170069 -0.0074682 -0.0055931 0.369449 unknown
polarizability: 173.4209279|-0.256514|137.9607993|-11.3702098|-4.5266406|69.7433926 unknown
InChI: InChI=1S/C10H13NO2/c1-7(12)9-6-8(4-5-11)2-3-10(9)13/h2-3,6,13H,4-5,11H2,1H3
charge 0 multiplicity 1
26 atoms
O  -2.742236 -1.658741 0.432262
O  -3.48338 0.939926 0.320418
N  4.791118 0.87752 0.433959
C  1.20515 -0.345925 -0.47513
C  2.624347 0.129258 -0.729487
C  0.135714 0.567747 -0.352514
C  -1.20164 0.180947 -0.049775
C  3.406402 0.415074 0.601211
C  0.916785 -1.722401 -0.28309
C  -1.45064 -1.218373 0.136351
C  -0.388303 -2.15078 0.015803
C  -2.279273 1.222435 0.05907
C  -1.885365 2.689863 -0.157438
H  3.19126 -0.628612 -1.305205
H  2.622004 1.058045 -1.333283
H  0.348225 1.631348 -0.503765
H  3.415221 -0.505151 1.215891
H  2.850527 1.172666 1.185592
H  1.719838 -2.463566 -0.375875
H  -0.594453 -3.220801 0.154671
H  4.889031 1.800043 0.001218
H  5.430739 0.188983 0.027954
H  -1.470422 2.856437 -1.169003
H  -1.127164 3.020778 0.576576
H  -2.789726 3.305231 -0.037848
H  -2.747261 -2.646448 0.530736
