program: Gaussian 09
title: 000158070
version: EM64L-G09RevD.01
frameworkgroup: C1[X(C21H19NO5)]
method: RPBEPBE
basis: SDD
operation: Freq
keyword: #p
keyword: freq=noraman
keyword: PBEPBE/SDD
title: #p freq=noraman PBEPBE/SDD
converged: YES YES NO NO
title: Mulliken charges:
elementType: O O O O O N C C C C C C C C C C C C C C C C C C C C C H H H H H H H H H H H H H H H H H H H
charge: -0.433584 -0.433921 -0.262138 -0.261717 -0.321214 -0.287095 -0.363609 0.091099 0.239444 0.282954 0.305396 0.284324 -0.346185 0.460431 -0.071908 -0.430646 -0.667669 -0.426228 -0.528888 -0.511879 0.192728 -0.574249 0.161587 -0.366868 0.168865 -0.203120 -0.521589 0.275049 0.201949 0.237515 0.223195 0.230348 0.252951 0.233551 0.227323 0.240271 0.282751 0.264331 0.240007 0.351923 0.385676 0.240633 0.238658 0.244487 0.228069 0.226993
chargesum: 0.00000
title: Mulliken charges with hydrogens summed into heavy atoms:
elementType: O O O O O N C C C C C C C C C C C C C C C C C C C C C
charge: -0.081660 -0.048246 -0.262138 -0.261717 -0.321214 -0.287095 -0.088560 0.091099 0.239444 0.282954 0.305396 0.284324 0.093279 0.460431 -0.071908 -0.207451 0.049181 -0.198905 -0.288618 -0.229128 0.192728 -0.309918 0.161587 -0.126861 0.168865 0.276171 0.177961
polarizability: 4.81015953e+02 1.57326976e+01 2.47483873e+02 -6.10484796e-01 1.45693330e+01 1.35474719e+02
1716.lowfreq: -53.3076 -7.8673 -4.1627 -0.0005 -0.0004 0.0005 4.0008 27.8837 51.5674
frequency: -53.3023 27.8472 51.5600 60.8711 70.0762 90.6067 98.1152 108.6302 117.4848 141.2924 156.9765 167.5896 171.9330 199.8642 215.8133 223.7737 230.8904 242.2580 277.8989 284.9053 305.8398 327.0260 334.4024 355.5768 380.2835 414.6825 417.5542 427.4486 439.0046 481.4960 497.7175 505.0161 511.6501 533.3099 553.2021 557.4160 572.4274 584.0825 619.9571 640.8616 645.8746 651.4601 678.9695 702.1004 710.5632 728.8392 758.2080 758.5630 783.2301 787.5258 802.3494 817.9692 828.8040 838.2202 858.1743 878.0827 895.8151 903.8738 912.8720 936.2170 957.5704 976.2872 980.8274 1001.4557 1020.7731 1034.8016 1059.9538 1065.3938 1074.0463 1098.9555 1115.2596 1115.9241 1119.1874 1134.3274 1154.1575 1160.7893 1181.3952 1184.2459 1190.2387 1209.2419 1216.6750 1229.7830 1248.0346 1257.1515 1260.3348 1274.5115 1293.2691 1310.8647 1325.6797 1355.3262 1362.1190 1373.8319 1380.3034 1400.0573 1411.8855 1429.6421 1435.8789 1453.8694 1458.7441 1464.9245 1469.8411 1471.2341 1473.3372 1476.1408 1484.9328 1486.3482 1488.4674 1527.3094 1578.8649 1599.8330 1623.9573 1630.1249 1639.2867 2941.7031 2963.9931 2968.2926 3015.5052 3047.0404 3047.6543 3059.1366 3085.1170 3093.8547 3102.1560 3126.2568 3129.3654 3145.4145 3152.4149 3167.6869 3169.2189 3185.2741 3432.5507 3514.3323
redmass: 2.2696 5.8222 5.1900 4.5547 5.6542 4.4511 5.4990 4.9092 3.0002 4.2421 4.2544 3.5331 3.4659 1.2727 2.0057 1.6104 5.1720 4.9261 4.5670 4.6941 5.0016 4.9503 4.9038 5.7322 5.1691 4.7726 3.1828 5.6764 5.4318 2.2904 1.1154 3.6763 2.8356 3.1896 3.5587 4.1585 5.5082 5.0152 5.0048 5.5578 4.8933 4.8866 8.7218 4.4302 6.3252 6.7366 5.4220 5.5805 3.8754 2.1299 1.7830 2.1926 2.7588 7.3543 7.0956 1.6094 1.4596 3.1745 1.3814 3.6344 1.3885 5.2323 4.9289 5.0604 3.4772 2.9308 3.2560 1.4565 3.1307 2.7962 1.4620 1.2784 1.0368 1.6644 1.5085 1.3804 1.6215 1.7795 1.8830 1.6477 1.4306 1.8792 2.4698 2.8182 2.1072 1.5444 3.8429 1.3030 2.3507 1.9289 1.3228 1.2656 3.3001 5.1351 4.3329 1.7162 1.2421 1.9752 3.8943 1.0500 1.8417 1.1261 1.1323 1.6496 1.2600 1.6753 1.1911 4.5653 8.2427 8.6856 7.9668 7.5449 8.1733 1.0452 1.0681 1.0323 1.0534 1.0878 1.0850 1.1045 1.0964 1.1187 1.1003 1.0866 1.1003 1.0887 1.0950 1.0956 1.0932 1.0921 1.0640 1.0646
irintensity: 14.3491 0.8643 2.0233 2.3644 0.5486 1.1212 2.3782 2.1307 1.7907 3.4766 0.5354 1.0502 4.8547 0.5575 0.7689 0.4365 0.4595 0.5710 4.8026 3.2868 2.7451 5.2381 11.0502 0.8024 1.9820 2.9800 7.1026 12.0858 10.6604 22.2101 117.7583 4.3700 64.1529 16.6677 11.9045 9.5220 5.9208 2.5824 3.7895 10.4410 1.0403 1.7231 3.2051 4.0960 4.1157 12.4216 2.1087 12.4252 27.1253 40.2660 22.2848 4.6551 27.2626 61.4641 2.4019 44.6823 39.0582 37.1991 1.0618 3.6248 3.5733 105.7789 172.9629 20.7647 32.0796 27.8918 97.7268 4.3793 42.4136 39.9159 2.8316 0.2267 0.0048 10.0186 16.1953 30.8530 145.9360 14.3922 49.1030 47.4274 18.3879 69.2948 197.8572 113.9090 51.8434 75.8508 163.3038 13.9324 10.4993 1.8405 3.0302 42.3988 52.6450 12.3985 13.0279 22.8320 26.4928 47.3631 340.3025 14.4403 13.7412 36.6508 64.7936 73.8887 33.7099 52.1297 1.1047 3.5287 11.4977 16.0597 13.2480 2.9551 4.2890 73.5512 35.0736 90.6185 169.0174 27.3917 3.4352 42.0807 20.1615 29.8236 17.6692 7.3980 23.7285 10.4003 15.6318 19.3088 6.8246 3.9122 28.5906 101.4172
temp: 298.150 k
press: 1.00000 atm
elementType: 8 8 8 8 8 7 6 6 6 6 6 6 6 6 6 6 6 6 6 6 6 6 6 6 6 6 6 1 1 1 1 1 1 1 1 1 1 1 1 1 1 1 1 1 1 1
symmnumber: 1
zpe: 935177.2 jmol-1
zpe.correction: 0.356190 hartree
zpe.thermalcorrener: 0.378867 hartree
zpe.thermalcorrenthalpy: 0.379811 hartree
zpe.thermalcorrgfe: 0.305108 hartree
zpe.sumelectzpe: -1240.549996 hartree
zpe.sumelectthermal: -1240.527319 hartree
zpe.sumelectthermalent: -1240.526375 hartree
zpe.sumelectthermalfe: -1240.601078 hartree
dipole: 2.9763 3.6533 -2.5473
dipole: 5.3567
quadrupole: -103.3488 -159.1188 -162.2718
quadrupole: 12.8108 -0.1026 9.8073
quadrupole: 38.2310 -17.5390 -20.6920 12.8108 -0.1026 9.8073
hfenergy: -1240.9061857 hartree
pointgroup: C01 [X(C21H19N1O5)]
dipole: 1.2151566 -1.4743266 0.889493 debye
polarizability: 480.7845527|-13.1882796|245.6081693|-12.6130646|20.3269335|137.5818231 unknown
InChI: InChI=1S/C21H19NO5/c1-22-15(9-23)19-12(5-6-16(25-2)21(19)24)13-4-3-11-7-17-18(27-10-26-17)8-14(11)20(13)22/h3-8,15,23-24H,9-10H2,1-2H3
charge 0 multiplicity 1
46 atoms
O  -0.071739 3.157152 -1.650431
O  4.133579 2.170802 0.028291
O  -5.263019 1.465764 0.67449
O  -6.110153 -0.716753 0.140882
O  5.969341 0.22792 0.027706
N  0.010292 1.313633 0.462391
C  1.292766 1.699146 -0.201095
C  -0.499303 0.02199 0.069208
C  2.313056 0.577353 -0.158597
C  0.393382 -1.010238 -0.319166
C  1.855234 -0.772529 -0.255148
C  -1.925261 -0.191997 0.070359
C  0.9814 2.144494 -1.658185
C  -2.44202 -1.501242 -0.287659
C  3.688203 0.843647 -0.059835
C  -0.149806 -2.276241 -0.717186
C  -0.023622 1.596232 1.925382
C  2.809813 -1.822118 -0.248327
C  -1.519541 -2.521881 -0.686507
C  -2.842082 0.873304 0.397328
C  4.633465 -0.218954 -0.066486
C  -3.861054 -1.753915 -0.278689
C  -4.19194 0.583357 0.394133
C  4.194194 -1.553411 -0.159879
C  -4.696591 -0.711266 0.070626
C  -6.504523 0.664216 0.524263
C  7.026214 -0.785047 0.010561
H  1.679132 2.585707 0.331299
H  0.685391 1.266795 -2.27092
H  1.874347 2.611622 -2.104122
H  0.527307 -3.067248 -1.055227
H  0.759547 1.034552 2.478311
H  -1.00408 1.310139 2.338703
H  0.128851 2.676439 2.094857
H  2.481851 -2.864895 -0.284208
H  -1.911064 -3.50108 -0.984385
H  -2.471589 1.877236 0.612744
H  -4.251773 -2.738299 -0.549406
H  4.908777 -2.381865 -0.155815
H  -0.73055 2.832872 -0.973619
H  5.125792 2.162337 0.090002
H  -7.117355 1.099616 -0.283393
H  -7.030116 0.630663 1.493966
H  7.970389 -0.22547 0.078996
H  7.000683 -1.365684 -0.931179
H  6.931774 -1.468954 0.875466
