program: Gaussian 09
title: 000157995
version: EM64L-G09RevD.01
frameworkgroup: C1[X(C11H16O2)]
method: RPBEPBE
basis: SDD
operation: Freq
keyword: #pfreq=noraman
keyword: PBEPBE/SDD
title: #p freq=noraman PBEPBE/SDD
converged: NO YES NO NO
title: Mulliken charges:
elementType: O O C C C C C C C C C C C H H H H H H H H H H H H H H H H
charge: -0.248429 -0.217264 0.188609 0.152420 0.382741 -0.433592 -0.436220 -0.446743 -0.718660 -0.744526 -0.714748 -0.531077 0.146393 0.211086 0.211392 0.229024 0.228161 0.223241 0.205691 0.221467 0.226012 0.217115 0.219632 0.224528 0.220404 0.208985 0.235697 0.253759 0.284901
chargesum: 0.00000
title: Mulliken charges with hydrogens summed into heavy atoms:
elementType: O O C C C C C C C C C C C
charge: -0.248429 -0.217264 0.188609 0.152420 0.382741 -0.011114 0.020966 -0.017811 -0.054066 -0.079962 -0.016307 -0.246176 0.146393
polarizability: 1.42439901e+02 -1.12203103e+01 1.21397371e+02 3.09361155e+00 -2.09476388e+00 9.56280447e+01
1716.lowfreq: -20.1254 -11.6476 0.0002 0.0005 0.0005 7.8975 81.1558 128.5682 141.3785
frequency: 81.0782 128.5570 141.3743 155.2309 201.6723 219.5153 252.2058 260.7372 268.7811 281.6184 302.0408 349.2157 358.3096 371.0821 424.2442 433.6496 494.5413 535.0361 554.6263 637.7942 662.9222 692.4041 701.9205 775.8007 839.3077 843.3039 854.5448 872.6780 880.5286 906.7144 935.3830 937.9098 976.8517 985.0348 1007.2855 1018.3453 1057.3814 1070.3438 1107.3130 1128.0004 1163.7269 1174.8919 1192.9801 1204.2935 1218.0725 1234.6467 1286.5826 1304.4510 1318.3767 1335.8711 1339.9877 1375.2655 1385.7582 1398.4133 1452.4279 1457.0154 1461.8841 1466.2668 1471.2003 1475.7299 1479.2364 1485.9056 1492.9868 1622.6361 1691.7774 2972.9096 2978.6057 2987.1983 2991.1867 2998.3284 3001.4892 3033.4478 3046.0051 3065.7727 3073.5311 3078.7915 3080.6857 3097.6128 3104.0969 3108.4129 3214.9248
redmass: 4.1195 2.9822 2.9944 1.0608 1.8243 2.3143 1.4841 2.2625 1.7398 2.0871 2.1169 2.6558 2.2813 3.4796 3.8634 3.0130 3.0761 3.1319 3.7407 3.0316 5.5335 3.3563 4.9088 2.6101 3.2147 3.4735 1.7890 2.2541 1.7524 1.9458 1.8857 1.6024 1.5975 1.6946 1.7219 1.7217 1.6163 1.7910 1.9824 2.4130 2.4279 2.7155 2.3262 2.4694 1.8487 1.8046 1.5270 2.2014 1.4529 1.6189 1.3987 1.2128 1.1979 1.2011 1.0717 1.0597 1.0693 1.0685 1.0610 1.0712 1.0590 1.0584 1.0608 8.4957 11.9808 1.0591 1.0363 1.0376 1.0609 1.0596 1.0371 1.0991 1.1008 1.1039 1.0998 1.0999 1.0993 1.0996 1.1003 1.0986 1.0976
irintensity: 0.2237 0.4098 1.5166 0.3106 2.7881 2.0398 0.2562 0.2996 0.0230 0.1731 0.0912 0.2048 1.2739 0.2124 2.1203 0.2287 2.2134 0.7399 3.5454 5.0804 8.7220 0.2703 2.7905 2.5072 14.8220 49.8064 24.8925 28.1605 24.8134 15.3229 2.7510 1.2376 6.0180 6.2597 6.0125 9.0125 1.4822 1.3272 28.9538 48.4428 14.4208 9.2680 6.2672 8.7344 1.7174 12.8138 8.6510 0.6124 2.0993 5.9930 0.1858 4.3376 28.0541 14.3932 3.2547 2.0881 4.6657 10.2951 6.5795 6.7009 18.5071 19.7964 9.2488 26.8118 498.9559 24.5449 31.0680 21.2219 29.2113 19.6828 18.5008 31.3901 40.7598 32.1327 6.5188 37.9354 48.0255 33.6287 6.9628 31.6774 1.5975
temp: 298.150 k
press: 1.00000 atm
elementType: 8 8 6 6 6 6 6 6 6 6 6 6 6 1 1 1 1 1 1 1 1 1 1 1 1 1 1 1 1
symmnumber: 1
zpe: 646154.9 jmol-1
zpe.correction: 0.246107 hartree
zpe.thermalcorrener: 0.258815 hartree
zpe.thermalcorrenthalpy: 0.259759 hartree
zpe.thermalcorrgfe: 0.208681 hartree
zpe.sumelectzpe: -578.218878 hartree
zpe.sumelectthermal: -578.206171 hartree
zpe.sumelectthermalent: -578.205227 hartree
zpe.sumelectthermalfe: -578.256305 hartree
dipole: 6.7219 -0.8354 0.5489
dipole: 6.7959
quadrupole: -98.5180 -75.4800 -76.5182
quadrupole: 3.2797 -2.5708 0.2530
quadrupole: -15.0126 8.0254 6.9872 3.2797 -2.5708 0.2530
hfenergy: -578.4649857 hartree
pointgroup: C01 [X(C11H16O2)]
dipole: -2.6487548 -0.1908561 -0.3103781 debye
polarizability: 143.153672|9.8483613|120.0345238|5.3030595|3.879926|96.2771209 unknown
InChI: InChI=1S/C11H16O2/c1-10(2)5-4-6-11(3)8(10)7-9(12)13-11/h7H,4-6H2,1-3H3
charge 0 multiplicity 1
29 atoms
O  1.956431 -0.844278 0.039781
O  3.460531 0.900244 0.477104
C  -1.5079 0.81856 -0.097953
C  0.485798 -0.945412 -0.261969
C  -0.019929 0.497938 -0.124233
C  -2.154378 -0.172553 0.940267
C  -0.196948 -1.826104 0.81303
C  -1.735548 -1.650209 0.756318
C  -2.169223 0.641827 -1.499322
C  -1.753876 2.274925 0.370539
C  0.411735 -1.554027 -1.679143
C  1.038566 1.314847 0.143514
C  2.294803 0.532671 0.240344
H  -3.255751 -0.074948 0.874136
H  -1.860456 0.155246 1.958164
H  0.179372 -1.514954 1.806278
H  0.089181 -2.883357 0.665358
H  -2.198031 -2.259891 1.55525
H  -2.129311 -2.047009 -0.199698
H  -3.223596 0.970143 -1.447215
H  -1.655328 1.259016 -2.257865
H  -2.160709 -0.403524 -1.847459
H  -2.839007 2.461242 0.468423
H  -1.285311 2.468501 1.35232
H  -1.351339 3.004925 -0.355674
H  -0.614231 -1.85887 -1.943067
H  0.775508 -0.83829 -2.435388
H  1.058271 -2.447473 -1.706791
H  1.028977 2.389413 0.32175
