program: Gaussian 09
title: 000158071
version: EM64L-G09RevD.01
frameworkgroup: C1[X(C13H20ClNO3)]
method: RPBEPBE
basis: SDD
operation: Freq
keyword: #p
keyword: freq=noraman
keyword: PBEPBE/SDD
title: #p freq=noraman PBEPBE/SDD
converged: YES YES NO NO
title: Mulliken charges:
elementType: Cl O O O N C C C C C C C C C C C C C H H H H H H H H H H H H H H H H H H H H
charge: -0.088410 -0.479432 -0.263956 -0.424598 -0.421509 0.281020 -0.481391 -0.159012 -0.688401 -0.699979 -0.707541 0.634085 -0.578410 -0.610175 0.393601 0.418264 -0.515376 -0.535988 0.276816 0.228643 0.245382 0.223836 0.219967 0.215747 0.206883 0.235537 0.221330 0.214448 0.202634 0.211298 0.232279 0.311843 0.363985 0.268747 0.357018 0.223990 0.245650 0.221177
chargesum: 0.00000
title: Mulliken charges with hydrogens summed into heavy atoms:
elementType: Cl O O O N C C C C C C C C C C C C C
charge: -0.088410 -0.115447 -0.263956 -0.067581 -0.144693 0.281020 -0.007366 0.064823 -0.045804 -0.028664 -0.061330 0.634085 -0.266567 -0.610175 0.393601 0.418264 -0.246629 0.154828
polarizability: 2.30175680e+02 -1.40938999e+01 1.81202099e+02 7.53801630e+00 1.10269348e+00 1.10442378e+02
1716.lowfreq: -11.1052 -4.5170 0.0016 0.0018 0.0020 7.1495 24.3201 28.6889 48.9757
frequency: 23.9389 28.6666 48.9674 73.2287 82.9372 94.2740 127.7350 151.8388 184.7131 196.6333 198.6326 223.7536 239.9996 247.2973 252.3889 259.0280 267.8703 275.7420 311.3489 320.2041 345.2242 346.9015 366.2237 409.7594 441.3858 444.2925 456.4511 465.3028 508.7939 520.8930 579.4025 595.6007 606.6853 619.1105 649.9388 695.0563 720.3117 736.6683 801.5149 837.0735 852.6611 860.2400 904.0292 908.2415 920.7558 926.6236 949.0067 974.3860 991.8410 1006.5436 1023.8255 1030.3243 1044.5031 1072.7265 1095.2580 1112.8053 1135.2571 1157.0529 1177.2002 1198.7171 1214.3744 1236.7480 1240.0994 1258.8318 1280.8827 1320.2807 1327.6711 1335.9355 1375.1914 1383.2918 1389.6304 1399.7871 1404.7468 1429.9755 1435.8665 1441.9116 1453.5726 1457.6385 1461.0291 1462.4252 1465.8238 1467.9463 1474.3138 1484.9429 1488.5538 1495.8601 1593.5864 1613.8698 2959.7678 2960.4710 2970.5168 2974.9413 2983.7072 2992.8145 3048.1308 3062.1408 3064.3688 3071.0461 3072.6564 3081.0974 3087.0762 3093.1925 3100.5143 3125.8979 3184.5901 3187.6053 3452.4258 3502.5866
redmass: 3.2926 5.1469 3.7071 5.4298 3.5257 3.8967 5.0008 5.9765 4.5587 1.2654 1.5697 2.6371 1.7690 1.9172 2.3826 3.5665 1.7946 1.1139 7.2542 5.6405 3.2032 3.6123 2.4473 2.4146 1.1151 2.4494 3.9685 2.3743 3.9723 6.2669 3.2021 5.2823 3.6880 5.2922 3.0407 2.9589 3.1896 2.6522 1.1627 1.6616 2.4463 2.4797 1.5524 1.6438 5.1202 1.6697 1.2211 4.6743 5.6927 1.8177 1.4351 2.1916 2.7135 4.1414 3.2422 1.2596 1.6565 1.4871 1.3790 1.3910 2.4538 2.2568 1.8327 1.8254 1.2298 1.3348 2.2979 1.3549 1.2103 1.2260 6.0557 1.4495 1.3150 1.7225 1.2639 2.1053 1.0850 1.0527 1.1114 2.1866 1.0500 1.0500 1.0897 1.0576 1.1017 1.0606 7.6132 7.0175 1.0339 1.0815 1.0356 1.0366 1.0366 1.0585 1.1039 1.1044 1.0989 1.0983 1.0997 1.0989 1.1006 1.0966 1.0662 1.0995 1.0914 1.0915 1.0751 1.0647
irintensity: 0.2761 1.5036 1.0119 1.6326 2.8520 2.1189 3.2196 2.6471 1.1525 0.1229 1.0615 6.7482 0.7636 1.5926 2.8065 1.6423 2.4298 0.7636 9.0941 2.2153 3.4897 7.0829 0.4423 1.4731 141.5963 3.7523 0.7482 0.1588 3.8742 1.3011 7.1393 23.3133 45.9434 0.5516 37.3056 7.7449 10.7413 24.4851 61.1080 23.5538 15.9427 20.5110 21.9991 13.1133 34.2535 12.2818 0.0853 47.4716 55.5660 16.9109 2.5178 8.4188 12.7007 26.5972 48.5826 0.1777 128.5049 76.4935 70.0974 19.9215 91.6557 3.5555 164.2426 23.1321 6.0284 14.5685 44.9562 12.9762 32.9134 21.8937 30.7597 123.9817 35.4920 98.0935 5.2735 53.7217 7.7091 0.3724 6.5626 32.6404 13.0792 2.6420 23.0015 16.7928 8.8487 22.5756 114.1321 113.9497 70.9978 21.6695 23.2881 40.9743 10.9193 24.4345 47.0081 19.6985 3.0354 57.7487 8.1981 59.5856 3.9241 164.6864 231.3824 23.6634 1.5378 6.0273 0.2483 44.3762
temp: 298.150 k
press: 1.00000 atm
elementType: 17 8 8 8 7 6 6 6 6 6 6 6 6 6 6 6 6 6 1 1 1 1 1 1 1 1 1 1 1 1 1 1 1 1 1 1 1 1
symmnumber: 1
zpe: 816260.6 jmol-1
zpe.correction: 0.310897 hartree
zpe.thermalcorrener: 0.330915 hartree
zpe.thermalcorrenthalpy: 0.331859 hartree
zpe.thermalcorrgfe: 0.262043 hartree
zpe.sumelectzpe: -1246.435285 hartree
zpe.sumelectthermal: -1246.415267 hartree
zpe.sumelectthermalent: -1246.414323 hartree
zpe.sumelectthermalfe: -1246.484139 hartree
dipole: -1.9749 0.5942 2.6060
dipole: 3.3234
quadrupole: -90.1837 -117.7898 -119.0687
quadrupole: -4.1363 -0.9748 -5.7979
quadrupole: 18.8304 -8.7758 -10.0546 -4.1363 -0.9748 -5.7979
hfenergy: -1246.7461822 hartree
pointgroup: C01 [X(C13H20Cl1N1O3)]
dipole: 0.7665093 -0.4424558 -0.9624366 debye
polarizability: 229.5083003|16.3524503|153.2368904|-4.0041533|-35.0827014|139.0749654 unknown
InChI: InChI=1S/C13H20ClNO3/c1-13(2,3)15-7-11(17)9-5-8(18-4)6-10(16)12(9)14/h5-6,11,15-17H,7H2,1-4H3
charge 0 multiplicity 1
38 atoms
Cl -0.229055 2.299356 -1.689625
O  1.049883 -0.578087 1.657474
O  -3.668221 -1.825873 1.072068
O  -3.223175 1.871848 -2.083485
N  2.909773 -1.066988 -0.126658
C  4.174235 -0.271559 -0.321605
C  1.63449 -0.579719 -0.713435
C  0.793187 0.133594 0.416967
C  4.615045 -0.267488 -1.814175
C  3.957784 1.179439 0.169518
C  5.260413 -0.958822 0.541288
C  -0.692722 0.119561 0.089808
C  -1.54431 -0.816845 0.708009
C  -1.261313 1.015076 -0.844002
C  -2.924859 -0.852895 0.390405
C  -2.636614 0.993916 -1.168431
C  -3.481182 0.046255 -0.547841
C  -5.108171 -1.88456 0.809402
H  3.079838 -2.055029 -0.355288
H  1.77249 0.101053 -1.574443
H  1.055709 -1.454325 -1.061878
H  1.127744 1.188273 0.506846
H  3.831943 0.166827 -2.462516
H  5.533966 0.331625 -1.951263
H  4.822631 -1.296191 -2.165393
H  3.595807 1.188064 1.212719
H  3.228859 1.720395 -0.460235
H  4.912563 1.733116 0.125471
H  5.402058 -2.014839 0.23913
H  6.231077 -0.444184 0.42651
H  4.975611 -0.940794 1.608062
H  -1.125164 -1.490242 1.458616
H  1.974622 -0.967966 1.484459
H  -4.539739 0.054177 -0.816975
H  -2.535272 2.494063 -2.44131
H  -5.60467 -0.932543 1.080402
H  -5.484075 -2.695479 1.450198
H  -5.314586 -2.12141 -0.252695
