program: Gaussian 09
title: 000014209
version: EM64L-G09RevD.01
frameworkgroup: C1[X(C4H9O4PS2)]
method: RPBEPBE
basis: SDD
operation: Freq
keyword: #p
keyword: freq=noraman
keyword: PBEPBE/SDD
title: #p freq=noraman PBEPBE/SDD
converged: NO YES NO NO
title: Mulliken charges:
elementType: S S P O O O O C C C C H H H H H H H H H
charge: 0.070188 -0.223012 0.600918 -0.458636 -0.463835 -0.410281 -0.213665 -0.678774 -0.481882 -0.481609 0.244155 0.321922 0.318510 0.250087 0.235558 0.248879 0.234717 0.249983 0.249832 0.386944
chargesum: 0.00000
title: Mulliken charges with hydrogens summed into heavy atoms:
elementType: S S P O O O O C C C C
charge: 0.070188 -0.223012 0.600918 -0.458636 -0.463835 -0.023337 -0.213665 -0.038342 0.252642 0.252924 0.244155
polarizability: 1.63912121e+02 -1.44919865e+00 9.61910296e+01 1.14411407e+01 -3.32263431e+00 1.03047205e+02
1716.lowfreq: -30.4621 -25.9144 -10.0635 0.0018 0.0021 0.0026 5.5313 14.8323 28.3634
frequency: -29.8209 -2.7187 27.9587 55.1758 65.2857 80.3822 101.8109 114.7634 130.7249 149.7233 157.9809 176.4102 206.3183 277.8049 341.0108 361.9077 367.9676 392.4169 489.5118 532.9744 563.0020 624.5901 653.7327 684.7573 726.6188 870.0471 899.7305 951.4170 981.3303 1046.9023 1109.9152 1116.3433 1123.3666 1132.0764 1141.4850 1228.5433 1320.5922 1422.5589 1423.7080 1428.5388 1451.5773 1453.1356 1468.5153 1470.1307 1667.2314 2980.1492 2983.3007 3043.6785 3081.6065 3085.2118 3112.0446 3132.8653 3132.9836 3517.3267
redmass: 4.7985 4.1778 5.7549 3.6379 3.8905 4.0216 1.1309 1.1935 4.3338 5.5793 7.8667 5.8726 6.3326 12.5670 5.0320 8.4407 5.9652 13.1419 1.7882 17.4811 4.8652 1.3687 11.1136 12.5007 6.6062 5.2738 1.7758 10.9251 11.4356 2.2177 1.2432 1.2480 1.2913 1.3022 1.1363 1.3098 2.1365 1.1106 1.1076 1.1081 1.0490 1.0476 1.0526 1.0525 8.7800 1.0306 1.0304 1.0580 1.1048 1.1050 1.1043 1.1026 1.1025 1.0641
irintensity: 1.0562 1.5065 1.4748 2.9312 5.6561 2.0948 0.5840 0.9169 2.3927 9.4689 2.6070 1.2894 3.0842 29.5449 4.5846 21.0932 5.4828 10.2822 29.3311 156.3561 45.1049 122.7672 86.0116 100.4723 49.0615 4.4003 5.3396 279.7385 24.8083 327.3135 0.2900 0.1370 1.4687 0.0980 0.0218 0.0341 69.6271 13.9136 27.5172 17.0120 9.1433 24.5362 13.6992 21.6226 175.4057 48.7157 35.4195 18.8150 19.1414 25.8384 0.0499 3.1590 13.2326 33.9577
temp: 298.150 k
press: 1.00000 atm
elementType: 16 16 15 8 8 8 8 6 6 6 6 1 1 1 1 1 1 1 1 1
symmnumber: 1
zpe: 359233.4 jmol-1
zpe.correction: 0.136825 hartree
zpe.thermalcorrener: 0.150833 hartree
zpe.thermalcorrenthalpy: 0.151778 hartree
zpe.thermalcorrgfe: 0.093705 hartree
zpe.sumelectzpe: -1595.165449 hartree
zpe.sumelectthermal: -1595.151440 hartree
zpe.sumelectthermalent: -1595.150496 hartree
zpe.sumelectthermalfe: -1595.208569 hartree
dipole: -1.3437 0.4796 -2.6024
dipole: 2.9679
quadrupole: -84.4724 -72.7535 -99.2696
quadrupole: 0.6094 4.0801 2.5072
quadrupole: 1.0261 12.7450 -13.7711 0.6094 4.0801 2.5072
hfenergy: -1595.3022734 hartree
pointgroup: C01 [X(C4H9O4P1S2)]
dipole: -0.4618836 0.0464147 1.0714134 debye
dipolederiv: -0.5180133 -0.0082169 -0.0774458 -0.0043305 -0.2388628 0.0068748 0.0747073 -0.0099757 -0.1420606 -0.7354501 0.0371746 0.1593254 0.0355654 -0.3906525 -0.0085913 0.1706553 -0.0140082 -0.4285354 2.101922 -0.0481981 -0.1312357 -0.0410927 1.5173626 -0.0297196 0.1875948 -0.0088476 1.2770941 -0.6460335 -0.0450911 0.0246669 -0.2192344 -1.2615512 -0.1303571 -0.1119114 -0.2171364 -0.5413254 -0.6249883 0.07042 0.0318474 0.2066865 -1.1967526 0.2798082 -0.1371414 0.3797359 -0.6440641 -0.9035227 0.0430589 0.567964 0.0624861 -0.4250173 -0.0745581 0.6168365 -0.0664029 -0.8604858 -0.8179146 0.0563257 -0.2137991 0.074128 -0.296517 0.0296648 0.1418264 -0.0073643 -0.8327549 -0.2570144 0.0449445 -0.1249976 0.038728 0.0917909 0.009638 -0.6532898 0.0398013 0.0118992 0.2420565 0.1355347 0.0507704 0.0993233 0.7212539 0.0691659 -0.0557651 -0.2808114 0.1410383 0.2372433 -0.1599186 0.1001319 -0.0969089 0.7724188 -0.1988059 -0.0312164 0.1389919 0.1397287 1.5453412 -0.1545334 -0.2426644 -0.185784 0.2386105 0.0301525 -0.2966159 0.0234343 1.3749603 0.0783645 -0.0069677 0.0129683 0.0042488 0.0500568 -0.0453074 0.0801516 -0.0528672 0.0400966 0.0574 0.0056552 0.0316222 -0.0007906 0.0416406 0.0427243 0.1026975 0.0478942 0.0320844 0.1214115 0.0054602 0.0202799 -0.0208262 -0.0453737 -0.0877102 0.0141384 -0.0841945 0.0033551 -0.0138018 0.0402267 -0.1081097 -0.0002416 0.0102548 0.0072155 -0.0742741 0.1302312 -0.0055577 -0.081745 -0.0608558 0.0470393 0.0286504 0.0395027 -0.0124709 0.0894642 0.0849636 0.0896697 0.0067481 -0.0451872 -0.0992503 -0.0176485 -0.0402565 -0.0135146 -0.072839 -0.1409409 0.0038397 0.1184258 -0.0080364 0.0323399 0.0240762 -0.0077456 0.0899278 0.0215736 0.085351 -0.0332816 -0.0910197 0.0679672 0.0081393 -0.0180778 0.0266479 0.0233587 0.0774881 -0.0666424 0.1141289 0.1805906 0.0302375 -0.0895923 0.0310424 0.3931897 0.0125045 -0.1440806 0.0187881 0.2601703 unknown
polarizability: 161.4996571|-7.2695455|96.0160541|-15.1800243|-0.349808|105.6346446 unknown
InChI: InChI=1S/C2H6O2PS.C2H3O2S/c1-3-5(6)4-2;3-2(4)1-5/h1-2H3;3H,1H2
charge 0 multiplicity 1
20 atoms
S  -0.471373 -0.086545 -1.353728
S  3.192841 -0.308087 -1.500764
P  1.555512 -0.112409 -0.265679
O  1.449074 1.263886 0.792943
O  1.316827 -1.258334 1.017258
O  -3.736806 0.341658 1.020298
O  -3.453049 0.313586 -1.289552
C  -1.511649 0.037534 0.22888
C  1.786376 2.580903 0.204683
C  1.766627 -2.649894 0.784181
C  -2.964653 0.241835 -0.144315
H  -1.148225 0.880306 0.839412
H  -1.394135 -0.884144 0.820075
H  1.705707 3.283423 1.046849
H  1.069313 2.85161 -0.592577
H  2.81539 2.576046 -0.196727
H  1.156691 -3.137557 0.001819
H  1.613303 -3.147728 1.752735
H  2.833636 -2.675519 0.500559
H  -4.692906 0.47123 0.774049
