program: Gaussian 09
title: 000157998
version: EM64L-G09RevD.01
frameworkgroup: C1[X(C15H12O6)]
method: RPBEPBE
basis: SDD
operation: Freq
keyword: #pfreq=noraman
keyword: PBEPBE/SDD
title: #p freq=noraman PBEPBE/SDD
converged: YES YES NO NO
title: Mulliken charges:
elementType: O O O O O O C C C C C C C C C C C C C C C H H H H H H H H H H H H
charge: -0.362014 -0.267379 -0.418442 -0.440083 -0.243063 -0.207126 0.214949 0.214407 0.233251 0.287102 -0.317226 -0.474544 -0.336193 0.136700 -0.308943 0.437510 -0.478899 -0.385826 0.113949 -0.207448 -0.502420 0.271963 0.299397 0.280959 0.273625 0.263284 0.275808 0.170424 0.241865 0.223487 0.238195 0.384539 0.388192
chargesum: 0.00000
title: Mulliken charges with hydrogens summed into heavy atoms:
elementType: O O O O O O C C C C C C C C C C C C C C C
charge: -0.362014 -0.267379 -0.033903 -0.051891 -0.243063 -0.207126 0.214949 0.214407 0.233251 0.287102 -0.045262 -0.175146 -0.055235 0.136700 -0.035318 0.437510 -0.215615 -0.110018 0.113949 -0.037024 0.201126
polarizability: 3.09746894e+02 -3.95996304e+00 1.75545913e+02 5.02105811e+00 4.31857674e+00 1.21937893e+02
1716.lowfreq: -4.4457 -0.0006 -0.0005 0.0004 2.7302 3.8611 15.1201 30.0183 32.6760
frequency: 14.9514 29.9353 32.6716 55.6199 66.6573 90.8367 110.1804 141.6089 149.0309 171.6583 177.8278 191.5168 212.7917 255.9370 258.4136 283.4622 318.5610 334.5469 352.9691 381.3551 397.5569 442.1612 448.4601 491.4795 495.4761 508.0767 536.8816 541.6183 575.2522 581.8121 611.1273 618.5366 629.2700 686.2541 695.2271 708.4006 729.8911 753.1447 766.7605 800.0993 825.7695 842.1360 868.1911 879.3886 929.2697 937.1408 962.1574 971.5063 978.4096 992.9764 1041.8758 1083.0622 1098.5196 1104.8741 1140.1242 1150.1734 1152.3712 1161.8006 1185.8585 1206.9002 1241.7278 1252.1527 1255.5937 1296.4797 1324.1892 1364.2993 1387.7565 1397.7358 1414.9968 1446.4515 1454.5110 1460.6403 1466.3635 1480.9656 1484.0993 1573.3191 1585.1234 1607.4137 1615.6188 1627.6896 1646.0620 2874.9707 2987.4475 3094.8273 3128.9954 3150.2041 3151.0245 3152.9751 3170.0469 3173.9323 3190.4513 3519.0931 3532.0808
redmass: 5.9543 6.1787 6.6121 4.0025 6.0198 7.7673 6.9344 3.6664 4.5357 1.9329 7.8971 4.8110 2.1978 3.6509 4.6376 4.3654 4.7764 5.6509 6.4945 8.2872 7.0026 3.3627 3.7062 3.7126 1.2457 6.0755 2.8436 5.2262 4.0900 4.0118 3.3669 2.0339 5.8428 5.4916 5.4582 4.1212 4.3509 4.8139 6.2499 5.5879 1.3550 1.4295 6.7915 1.4431 1.5001 3.7118 1.3588 1.3430 6.9520 1.7664 2.6412 2.7502 1.9625 1.3345 1.6674 1.3918 1.3909 1.4946 2.0334 1.8657 2.4696 1.7507 2.0844 2.2413 2.5983 1.8655 6.8627 2.6438 3.0886 1.4630 3.4465 1.0611 1.0627 2.9356 3.1849 8.3041 8.6546 6.5501 6.7434 6.9723 8.8609 1.0852 1.0320 1.1018 1.1043 1.0900 1.0904 1.0898 1.0969 1.0922 1.0957 1.0648 1.0642
irintensity: 2.1807 1.0888 1.5839 5.2683 1.1667 1.4589 1.2764 6.7219 0.6999 1.9747 1.2919 8.5345 1.1073 8.3587 4.2925 3.9906 6.3842 6.5513 12.8845 3.2028 0.8921 5.0357 25.2758 15.8373 110.2867 5.8317 44.8654 39.4073 17.5506 0.7830 21.2582 81.7841 20.7211 13.2392 21.0493 8.4371 34.0223 16.1723 59.7233 7.0546 47.0416 15.5175 36.5720 17.3087 25.6815 61.0659 0.1217 1.0654 249.1667 9.7066 117.0990 11.6528 245.5502 56.9799 55.7669 44.1124 56.3566 19.0640 129.9498 119.8336 112.3043 102.8743 165.0683 270.1739 174.6194 8.6275 29.1233 115.0283 20.0722 25.5887 6.1096 15.3001 37.4602 155.7984 90.6115 110.2102 234.9338 175.2244 18.5006 39.7878 295.5535 140.2232 54.1686 34.8156 24.8456 5.0524 1.3825 2.3321 3.4326 3.1917 1.0226 73.4254 56.3801
temp: 298.150 k
press: 1.00000 atm
elementType: 8 8 8 8 8 8 6 6 6 6 6 6 6 6 6 6 6 6 6 6 6 1 1 1 1 1 1 1 1 1 1 1 1
symmnumber: 1
zpe: 626064.2 jmol-1
zpe.correction: 0.238455 hartree
zpe.thermalcorrener: 0.257813 hartree
zpe.thermalcorrenthalpy: 0.258758 hartree
zpe.thermalcorrgfe: 0.188321 hartree
zpe.sumelectzpe: -1028.615867 hartree
zpe.sumelectthermal: -1028.596509 hartree
zpe.sumelectthermalent: -1028.595564 hartree
zpe.sumelectthermalfe: -1028.666001 hartree
dipole: -1.1044 0.8208 1.2474
dipole: 1.8572
quadrupole: -147.1548 -120.1477 -121.7874
quadrupole: 23.0591 2.4123 -7.4346
quadrupole: -17.4582 9.5490 7.9092 23.0591 2.4123 -7.4346
hfenergy: -1028.854322 hartree
pointgroup: C01 [X(C15H12O6)]
dipole: 0.4612987 0.2045183 -0.5284759 debye
polarizability: 309.3084436|-8.2621517|173.4767426|5.0511224|-12.3957054|124.445514 unknown
InChI: InChI=1S/C15H12O6/c1-20-14-7-10(15(18)19)3-5-13(14)21-12-4-2-9(8-16)6-11(12)17/h2-8,17-18H,1H3
charge 0 multiplicity 1
33 atoms
O  -0.120906 1.075131 -0.826541
O  2.093622 2.499392 0.4813
O  -2.215841 1.914467 -2.298784
O  4.981885 -2.776696 -0.235659
O  5.913464 -0.844208 0.654557
O  -5.730406 -1.41269 1.40202
C  1.086589 0.402716 -0.484848
C  2.141867 1.158053 0.103965
C  -1.380265 0.543162 -0.448764
C  3.578689 -0.832547 -0.070862
C  1.270225 -0.952726 -0.841325
C  3.389576 0.518985 0.292917
C  2.509879 -1.57967 -0.634478
C  -2.455413 1.043672 -1.235533
C  -1.603182 -0.333865 0.633696
C  -4.0060 -0.233214 0.156179
C  -3.769101 0.651289 -0.928806
C  -2.921924 -0.723394 0.934371
C  4.92052 -1.431308 0.162443
C  -5.400076 -0.634958 0.466568
C  0.822741 3.112482 0.9196
H  0.438827 -1.496988 -1.301059
H  4.212216 1.087348 0.736729
H  2.665889 -2.623736 -0.91417
H  -0.759477 -0.702075 1.225421
H  -4.594542 1.035375 -1.538151
H  -3.138628 -1.400458 1.766579
H  -6.176531 -0.188352 -0.205466
H  1.130908 4.025153 1.451385
H  0.272757 2.444007 1.607417
H  0.185029 3.368702 0.058494
H  -1.236186 2.054119 -2.392655
H  5.898095 -3.120568 -0.058141
