program: Gaussian 09
title: 000157922
version: EM64L-G09RevD.01
frameworkgroup: C1[X(C6H11NO3)]
method: RPBEPBE
basis: SDD
operation: Freq
keyword: #p
keyword: freq=noraman
keyword: PBEPBE/SDD
title: #p freq=noraman PBEPBE/SDD
converged: YES YES NO NO
title: Mulliken charges:
elementType: O O O N C C C C C C H H H H H H H H H H H
charge: -0.264652 -0.235581 -0.247080 -0.618557 -0.508379 -0.497957 0.230174 -0.423717 0.249881 -0.504336 0.277603 0.236665 0.284695 0.252945 0.237005 0.211821 0.317585 0.281808 0.235331 0.243239 0.241508
chargesum: 0.00000
title: Mulliken charges with hydrogens summed into heavy atoms:
elementType: O O O N C C C C C C
charge: -0.264652 -0.235581 -0.247080 -0.019165 0.005889 0.039684 0.230174 0.025109 0.249881 0.215741
polarizability: 1.13016309e+02 2.04642448e+00 7.37924550e+01 -1.23899263e-01 2.03710242e+00 5.97903596e+01
1716.lowfreq: -13.5250 -8.0847 -2.5345 -0.0005 -0.0004 0.0007 31.4206 41.8584 56.5760
frequency: 31.3518 41.5669 56.5700 99.9837 114.8884 133.6236 174.0036 222.9653 230.4605 246.7713 290.3699 352.8883 428.3412 457.3497 500.2279 570.2069 623.4328 671.4588 758.8686 801.6409 858.9280 919.4830 958.7254 1023.2640 1046.8104 1104.7300 1108.4199 1113.8961 1135.9100 1149.5712 1159.8788 1197.8970 1199.0737 1243.0165 1308.8891 1352.1877 1372.5339 1423.5249 1437.5312 1449.2696 1453.2838 1460.2989 1464.4639 1591.2400 1639.3987 1644.3492 2848.7456 2933.2619 2974.6878 2996.4884 3005.6802 3037.3322 3075.3604 3107.7401 3150.9820 3507.1739 3660.2331
redmass: 4.5616 4.0674 3.6408 1.0763 3.1863 2.3502 3.1026 1.2074 2.8139 5.0727 4.0624 4.7134 1.7042 2.3089 1.7930 3.0772 5.0226 3.3174 1.6727 3.0931 3.1514 2.6983 4.1542 2.4145 3.6966 2.2951 1.3012 1.2730 1.9801 1.4387 1.6148 1.2284 2.6855 1.2317 1.4261 1.6838 1.9133 1.1949 1.0798 1.0903 1.0501 1.1057 1.0506 1.6009 3.9652 3.6339 1.0720 1.0827 1.0637 1.0646 1.0299 1.0943 1.0958 1.1046 1.1048 1.0466 1.0988
irintensity: 1.2589 3.0372 0.7350 0.2608 3.9566 2.8119 7.9052 63.0979 5.6587 7.4188 35.2349 4.6646 115.5127 99.0768 115.9651 7.9596 4.7139 2.7257 20.7276 15.0921 4.0860 9.8069 31.2089 1.5829 7.6032 71.7687 6.2946 0.4902 174.2930 6.3426 123.7798 3.2164 8.4489 75.1631 86.1012 47.9963 12.1602 22.4902 11.7701 53.0369 14.0175 13.1682 13.4393 144.4806 137.4207 65.5848 70.5410 53.7387 14.9431 29.9090 27.3052 11.6041 9.4635 27.0037 16.2522 10.2032 20.2528
temp: 298.150 k
press: 1.00000 atm
elementType: 8 8 8 7 6 6 6 6 6 6 1 1 1 1 1 1 1 1 1 1 1
symmnumber: 1
zpe: 442147.1 jmol-1
zpe.correction: 0.168405 hartree
zpe.thermalcorrener: 0.180682 hartree
zpe.thermalcorrenthalpy: 0.181627 hartree
zpe.thermalcorrgfe: 0.128451 hartree
zpe.sumelectzpe: -514.848614 hartree
zpe.sumelectthermal: -514.836336 hartree
zpe.sumelectthermalent: -514.835392 hartree
zpe.sumelectthermalfe: -514.888568 hartree
dipole: -0.7918 0.5567 2.8430
dipole: 3.0032
quadrupole: -45.9859 -65.1350 -60.7751
quadrupole: 4.7689 6.0947 2.5451
quadrupole: 11.3127 -7.8363 -3.4764 4.7689 6.0947 2.5451
hfenergy: -515.0170186 hartree
pointgroup: C01 [X(C6H11N1O3)]
dipole: 0.328034 -0.330582 1.085917 debye
dipolederiv: -1.417468 -0.2624219 -0.1610338 -0.3718806 -0.5267945 -0.1686532 -0.2634405 -0.1732253 -0.4233514 -0.6897068 0.0557404 -0.0027083 0.0072848 -0.8122063 0.1871326 0.0170131 0.1884791 -0.3610122 -0.7237104 0.0975636 0.0947788 -0.1678376 -0.7068551 -0.2959078 -0.1092888 -0.2977813 -0.5326814 -0.7396919 0.110129 -0.1983987 0.0542636 -0.4123841 -0.1991889 -0.2822448 -0.1975565 -0.7418283 -0.4133957 0.1206867 -0.0047753 0.3146417 -0.0753898 -0.0208946 0.1253911 -0.0622195 0.1118743 -0.3344757 0.0754014 0.0584516 0.2812277 -0.0670324 -0.0582719 -0.0043846 -0.0261356 0.0910479 1.0988316 0.0062563 -0.0904253 0.0295589 0.8674984 -0.2755044 -0.1953398 -0.2870212 0.1944501 0.2227964 -0.3516083 0.2605964 -0.5793427 0.046711 0.1343435 0.367557 0.2105938 0.3179361 1.6417154 0.1129592 0.0563078 0.3958106 0.9020619 0.5147092 0.3417828 0.5120704 0.5758056 0.6411739 0.0384184 0.0173409 -0.0456619 0.2366099 -0.0291123 -0.0624437 -0.0342787 0.2534176 0.1435508 0.0142027 -0.0026025 -0.065177 0.0712796 -0.0487875 -0.0646689 -0.0564476 0.0098394 0.038966 -0.0314163 0.0219003 -0.0720829 -0.0012363 0.0945039 -0.0068634 0.1219563 -0.0176063 0.1767244 0.0294436 0.0010852 -0.0767598 0.0438956 0.0594427 0.0463952 0.065646 0.0547427 0.0499484 -0.0167321 -0.0125855 -0.0636623 0.0848676 -0.0522408 -0.0058901 -0.0749563 -0.0534809 -0.0104648 0.0908839 0.00789 0.144248 -0.1186725 -0.0466161 -0.0049251 -0.0984601 0.0541039 -0.0393778 0.0130522 -0.0826465 0.0373087 0.0646385 0.0185846 -0.1062979 0.0623024 -0.1999198 0.2791545 -0.0310053 0.0236389 0.0792465 0.1249537 0.0533998 0.0296622 0.0054821 0.3495296 0.1132421 0.0013423 0.070233 0.0566618 0.237949 0.1095863 0.142286 0.1134811 0.2882355 -0.0243437 -0.0642751 -0.0448778 -0.1033183 0.0206247 -0.0748732 -0.0742529 -0.0762799 0.0655618 -0.0031479 -0.0005591 -0.0146766 0.0418156 0.0996869 0.0178781 0.0884752 0.0374394 -0.1085571 -0.0103208 -0.0080616 0.0025075 0.1036553 -0.0802056 0.0804702 0.021478 0.0669115 0.071893 unknown
polarizability: 112.8377238|3.3283296|74.2497919|0.1108176|-0.4530535|59.5116081 unknown
InChI: InChI=1S/C6H11NO3/c1-10-6(9)3-2-5(8)4-7/h2-4,7H2,1H3
charge 0 multiplicity 1
21 atoms
O  2.957379 0.648948 0.380151
O  -2.089569 1.221267 -0.507167
O  2.135817 -1.091211 -0.930789
N  -4.368397 -0.239278 -0.169299
C  -0.548192 -0.591195 0.060758
C  0.574073 0.449504 0.2181
C  -1.927655 0.044119 -0.083381
C  -3.126195 -0.827792 0.291562
C  1.927621 -0.107534 -0.182242
C  4.334177 0.239567 0.006805
H  -0.35355 -1.185043 -0.857347
H  -0.551754 -1.322447 0.890875
H  0.345977 1.315886 -0.434965
H  0.632343 0.850212 1.244388
H  -2.948597 -1.842136 -0.131013
H  -3.057137 -0.955972 1.403543
H  -4.297129 0.746497 -0.4313
H  -5.231052 -0.526626 0.28677
H  4.988769 0.949637 0.530773
H  4.468571 0.304768 -1.085946
H  4.525998 -0.796271 0.333427
