program: Gaussian 09
title: 000157894
version: EM64L-G09RevD.01
frameworkgroup: C1[X(C8H16N)]
method: RPBEPBE
basis: SDD
operation: Freq
keyword: #p
keyword: freq=noraman
keyword: PBEPBE/SDD
title: #p freq=noraman PBEPBE/SDD
converged: YES YES NO NO
title: Mulliken charges:
elementType: N C C C C C C C C H H H H H H H H H H H H H H H H
charge: -0.119444 -0.023980 -0.370204 -0.492075 -0.356204 -0.440808 -0.402466 -0.412734 -0.594694 0.278407 0.281791 0.288129 0.258553 0.298376 0.258365 0.268856 0.238427 0.257500 0.260265 0.227739 0.265382 0.218834 0.274864 0.264383 0.272738
chargesum: 1.00000
title: Mulliken charges with hydrogens summed into heavy atoms:
elementType: N C C C C C C C C
charge: -0.119444 0.254427 0.199716 0.064855 0.171017 0.055119 0.085538 0.071482 0.217291
polarizability: 8.85598858e+01 1.18319839e-01 8.40089813e+01 9.70991363e-01 6.05052017e-01 7.62048406e+01
1716.lowfreq: -15.9461 -13.8077 -0.0006 0.0006 0.0007 12.0090 136.6872 161.0820 186.8934
frequency: 136.6382 161.0602 186.8781 255.3954 286.0200 350.8779 365.7495 397.1009 431.0013 470.5104 585.6982 601.0546 653.9844 761.4298 778.4472 836.4402 854.0557 873.0697 892.4443 914.5202 952.8715 973.3308 989.6824 1026.6501 1035.3344 1074.4190 1102.1530 1124.7422 1131.1253 1161.7302 1172.5262 1189.5199 1215.8671 1223.9797 1254.3432 1257.8970 1282.4154 1301.0772 1316.7875 1334.7353 1349.8126 1354.3769 1367.5859 1374.1391 1430.5847 1458.8390 1463.4446 1466.7084 1470.7010 1471.9214 1477.8968 1482.8211 1493.2286 2994.2881 2996.0537 3002.8620 3017.6708 3027.3808 3036.4009 3052.2352 3057.2742 3058.8950 3066.6188 3077.3380 3097.7418 3129.4949 3134.1153 3136.4025 3148.1788
redmass: 2.3607 2.1821 1.1448 1.8227 2.2932 1.9225 2.0995 2.4256 2.8437 2.5849 2.3331 2.5739 2.7096 1.8411 1.5543 2.3672 2.9239 1.8587 1.4554 2.2083 2.4094 2.1406 2.4537 1.6745 2.0533 1.9481 1.1834 1.2046 1.6546 2.1993 1.5945 1.4422 1.5380 1.4376 1.3269 1.3377 1.3171 1.3145 1.4633 1.4153 1.4268 1.5587 1.2894 1.3725 1.1499 1.0779 1.0688 1.0784 1.0704 1.0775 1.0598 1.0841 1.0990 1.0655 1.0651 1.0623 1.0329 1.0606 1.0867 1.0989 1.0593 1.0656 1.0976 1.1000 1.1074 1.1041 1.1075 1.1051 1.1094
irintensity: 0.1811 0.0707 0.0464 0.1552 0.2165 0.6249 0.1572 0.0545 0.5127 0.5341 2.5333 3.1724 4.3143 10.1045 2.9933 1.7646 21.2868 0.8578 11.2011 16.2144 18.4254 3.9863 12.1712 7.0693 0.0839 0.9559 0.8978 1.3018 1.0945 1.6041 2.5187 3.1694 0.4929 4.9650 12.4998 9.0008 4.6810 8.0294 0.7006 2.9368 2.3076 1.9665 0.6038 0.5202 14.4288 24.2953 15.3107 12.0629 14.5181 5.6699 32.2732 29.0225 26.4924 5.1587 11.6992 21.1621 3.6796 7.9959 8.9636 6.2159 11.1228 5.6980 10.3862 20.5340 12.2396 3.1107 3.4186 1.2915 7.8980
temp: 298.150 k
press: 1.00000 atm
elementType: 7 6 6 6 6 6 6 6 6 1 1 1 1 1 1 1 1 1 1 1 1 1 1 1 1
symmnumber: 1
zpe: 607754.2 jmol-1
zpe.correction: 0.231481 hartree
zpe.thermalcorrener: 0.240110 hartree
zpe.thermalcorrenthalpy: 0.241054 hartree
zpe.thermalcorrgfe: 0.198968 hartree
zpe.sumelectzpe: -368.206214 hartree
zpe.sumelectthermal: -368.197586 hartree
zpe.sumelectthermalent: -368.196642 hartree
zpe.sumelectthermalfe: -368.238727 hartree
dipole: -2.0944 -0.8062 0.1937
dipole: 2.2526
quadrupole: -41.7425 -44.8294 -47.6939
quadrupole: 0.4414 -0.6185 0.0153
quadrupole: 3.0127 -0.0741 -2.9386 0.4414 -0.6185 0.0153
hfenergy: -368.4376955 hartree
pointgroup: C01[X(C8H16N1)]
dipole: -0.8107684 0.341893 -0.1057081 debye
dipolederiv: -0.4515505 -0.0262572 0.0220529 -0.0301608 -0.5007122 -0.0257309 0.0496158 -0.005393 -0.295899 0.3399603 -0.0994125 -0.0183706 -0.1852563 0.4637212 0.0856388 -0.1131653 0.0557702 0.1513371 0.2333686 0.0724971 -0.1129826 0.1521483 0.1609434 -0.0237374 -0.106486 0.0044509 0.2277997 -0.0164941 0.0208966 0.1054147 0.0529056 0.0007404 0.0459938 0.0949813 -0.0127707 0.0027137 0.3216151 0.1305429 0.1320334 0.1453514 0.1790124 0.072312 0.1460812 0.1288907 0.2047805 -0.0381348 0.0221872 -0.0172113 0.0500541 -0.0455115 -0.0483408 0.0014218 -0.0140743 0.0689534 -0.0140893 -0.02242 -0.024769 -0.0410736 0.0176794 -0.050026 -0.0487599 -0.0747613 0.08043 0.0201941 0.0203439 0.0049539 0.0068848 0.0846738 -0.0197544 0.0539191 -0.027138 0.1124893 0.0857033 -0.0710057 0.0518793 -0.0805425 0.1403909 -0.0846958 0.0756652 -0.1247819 0.1878104 -0.033417 -0.0192658 -0.0819515 0.0066566 0.0500619 0.0223669 -0.0693316 -0.0012932 -0.034953 -0.0015257 0.0058315 -0.0486678 -0.00259 0.0678738 0.0112404 -0.0942626 0.020975 0.0275119 0.0965613 -0.0098664 -0.0052248 0.0319071 0.0161965 -0.0748737 0.0433867 -0.0519072 -0.0002613 0.0242367 0.0380242 -0.095325 0.0166923 0.093719 -0.0188993 -0.0716665 0.0122103 -0.0080999 0.0565843 -0.0699993 0.0006583 -0.053673 -0.000406 -0.0058768 -0.0243873 -0.0353326 0.1022905 0.0353379 -0.0264893 0.0080678 -0.0447059 0.0440375 0.103006 0.007308 0.0501022 -0.0292843 0.0021874 0.0877022 0.006797 0.0592274 -0.0507749 -0.0333558 -0.0192461 -0.0005874 0.0962888 0.0116882 -0.0158989 0.0175085 -0.0406444 0.0803067 0.0956391 0.0153596 0.0420785 -0.0876359 0.0686477 0.010685 0.0017122 -0.005931 -0.0790192 -0.0280548 -0.0119699 -0.000643 0.1058444 0.0248808 -0.0557769 -0.0543128 -0.0356203 0.0350216 -0.0646562 -0.057845 -0.0842746 0.0227797 0.0776566 0.0438014 0.0031494 0.0389613 0.0281571 0.0668317 0.0398046 0.1108247 -0.0840752 -0.1023751 0.0259912 0.0359091 0.0103532 0.0721967 -0.0164777 0.0550535 -0.0184476 0.0802957 0.1107575 -0.0403021 0.0445684 -0.0113773 -0.000442 0.0534247 -0.0043692 0.0652727 -0.1140176 -0.0053015 -0.0420134 0.0807103 -0.0123226 0.0937834 0.0254871 0.0407941 0.0400209 0.0838688 0.0569339 -0.038514 -0.0665011 -0.0848561 0.0291644 -0.0663992 -0.0529708 -0.0126697 0.06164 0.0965741 0.0587183 0.0099014 0.0576118 0.0191857 -0.0210615 0.0510692 -0.0665216 0.0373922 unknown
polarizability: 88.5519394|-0.3631008|84.0768086|-0.8680492|0.047749|76.1449597 unknown
InChI: InChI=1S/C8H16N/c1-9-6-3-2-4-8(9)5-7-9/h8H,2-7H2,1H3
charge 1 multiplicity 1
25 atoms
N  -0.77208 0.499544 -0.110738
C  -0.308422 -0.956384 -0.576104
C  -1.88429 -0.217471 0.719072
C  -1.076397 -1.544021 0.648136
C  0.253737 1.185843 0.819179
C  1.188117 -1.156607 -0.819846
C  1.695482 1.056239 0.306029
C  2.0971 -0.430314 0.19746
C  -1.235016 1.432661 -1.200516
H  -0.880754 -1.15231 -1.501321
H  -2.813781 -0.238075 0.1283
H  -2.060959 0.259188 1.6937
H  -0.436265 -1.710661 1.528745
H  -1.658212 -2.453951 0.450542
H  0.17008 0.697608 1.805004
H  -0.071852 2.235049 0.923218
H  1.437018 -0.807931 -1.840617
H  1.378103 -2.247007 -0.810346
H  2.347679 1.58487 1.024365
H  1.824217 1.567823 -0.667488
H  3.146662 -0.518781 -0.130704
H  2.038381 -0.907594 1.195268
H  -0.363603 1.79653 -1.766845
H  -1.91705 0.897485 -1.878941
H  -1.762495 2.288067 -0.748251
