program: Gaussian 09
title: 000157980
version: EM64L-G09RevD.01
frameworkgroup: C1[X(C20H11ClF5N3O3)]
method: RPBEPBE
basis: SDD
operation: Freq
keyword: #p
keyword: freq=noraman
keyword: PBEPBE/SDD
title: #p freq=noraman PBEPBE/SDD
converged: YES YES NO NO
title: Mulliken charges:
elementType: Cl F F F F F O O O N N N C C C C C C C C C C C C C C C C C C C C H H H H H H H H H H H
charge: -0.023093 -0.166225 -0.152125 -0.152147 -0.156055 -0.219580 -0.280746 -0.205176 -0.159801 -0.488702 -0.494535 -0.062768 0.503101 0.356708 0.126489 0.148699 -0.330174 -0.433418 -0.292447 -0.396428 -0.180686 -0.091475 0.282940 0.284249 0.214977 -0.068140 0.256719 0.285724 -0.324148 -0.380857 -0.375520 -0.146205 0.307183 0.226933 0.312046 0.268892 0.307967 0.300599 0.334994 0.276224 0.269515 0.267280 0.249212
chargesum: 0.00000
title: Mulliken charges with hydrogens summed into heavy atoms:
elementType: Cl F F F F F O O O N N N C C C C C C C C C C C C C C C C C C C C
charge: -0.023093 -0.166225 -0.152125 -0.152147 -0.156055 -0.219580 -0.280746 -0.205176 -0.159801 -0.180735 -0.159541 -0.062768 0.503101 0.356708 0.126489 0.148699 -0.022991 -0.206485 0.019599 -0.127536 0.119913 -0.091475 0.282940 0.284249 0.214977 -0.068140 0.256719 0.285724 -0.047924 -0.111342 -0.108240 0.103007
polarizability: 5.07745502e+02 3.01700221e+01 2.76601424e+02 5.79422808e+00 2.47751259e+00 1.12089367e+02
1716.lowfreq: -6.2962 -2.4319 -1.5282 -0.0016 -0.0014 -0.0007 6.1836 11.6551 21.4758
frequency: 6.1491 11.6141 21.4655 22.7043 31.9551 44.1331 50.2051 58.0901 69.7839 74.9666 84.3828 94.3881 118.0865 138.2366 144.9617 159.6213 191.0237 202.6606 226.8210 229.2892 252.2822 258.8228 265.2638 280.7076 315.0626 327.5036 344.9078 355.7948 363.2723 375.6890 385.7540 398.6390 414.7297 433.3303 444.7354 474.7389 494.0949 498.2012 502.9445 518.6905 523.0573 561.9026 569.9819 574.6642 585.7850 591.1721 609.6365 614.8141 617.5931 654.8229 659.5960 673.2727 705.9466 714.8857 716.6211 750.0876 755.0844 757.8389 785.6888 801.9955 821.5736 829.2421 869.8373 882.2720 886.4122 890.0783 901.1984 925.6429 934.0217 948.3333 967.4883 969.9107 977.1957 999.3485 1003.4837 1007.4439 1017.8989 1051.4179 1099.9951 1106.6087 1121.4113 1143.7520 1156.6481 1167.4498 1184.1130 1198.0460 1200.9163 1227.0085 1231.9449 1261.4581 1269.2218 1290.0301 1308.7122 1329.3517 1368.2205 1375.5036 1391.3500 1415.8468 1420.1414 1433.9227 1448.3180 1453.3162 1491.1043 1506.6522 1535.7599 1574.3972 1584.0923 1596.3478 1619.8496 1622.5360 1637.4439 1680.5135 3123.1031 3159.4991 3163.0103 3175.8988 3183.2360 3187.3077 3192.1543 3193.5757 3215.3160 3511.8981 3522.3700
redmass: 10.9036 9.1647 7.3486 8.2071 6.6448 11.8855 14.6704 8.0867 7.1075 7.4669 13.0212 7.2624 8.2987 9.3728 11.4463 12.3362 7.1710 9.0708 9.0576 4.8809 11.5064 9.7439 9.5643 12.6493 11.4562 9.3343 8.6936 8.0353 8.2017 6.0283 9.4883 6.9326 3.1941 7.4691 11.3620 5.0658 7.3635 4.5175 8.3519 2.4905 8.7529 5.9480 1.4451 4.0854 6.1683 6.8388 6.2682 1.5048 4.8354 6.9292 6.4953 7.0849 6.3875 6.3604 4.7076 7.3994 5.3424 2.6126 8.2334 2.5406 1.4525 5.4255 1.4064 1.3985 7.2635 7.1270 1.4994 1.3646 7.7438 1.3574 1.4892 4.8271 8.4721 1.3008 2.9914 10.5493 12.1477 2.5588 2.6425 2.4000 1.3137 2.3992 2.3186 1.1784 2.3147 1.7737 2.6920 4.3929 3.0152 2.2333 1.8192 2.1929 1.9186 7.9637 5.1881 10.8808 4.0527 3.5586 3.2777 2.7786 3.1294 1.9304 2.2787 2.3111 8.0897 7.1406 7.1587 5.7609 8.3973 6.3068 5.0451 7.5268 1.0904 1.0936 1.0882 1.0952 1.0931 1.0938 1.0914 1.0998 1.0948 1.0776 1.0765
irintensity: 2.8385 0.1299 2.3812 1.0279 0.3379 3.9621 0.4189 4.7006 1.6950 2.6876 0.1602 0.7205 5.1620 1.0972 3.4143 1.3856 2.9495 3.5326 4.3647 0.0671 0.7254 0.8185 0.0982 0.1114 0.7534 4.3765 9.1824 3.0282 0.9920 1.5109 2.3368 0.1436 0.0252 1.2206 3.6851 2.3158 4.6481 6.5303 17.0928 29.0594 18.5398 3.1061 44.9889 1.0646 5.3826 13.1611 23.3084 149.0140 16.3668 14.0732 5.0791 7.8291 49.0511 6.3199 7.8439 8.8242 6.9260 12.6408 53.0690 75.3447 35.2541 17.1449 72.8693 0.5255 34.9685 28.2470 39.2641 15.2442 44.0274 0.1123 7.6588 46.5001 192.3997 0.5151 30.4221 220.3776 28.6331 9.6228 41.4608 119.3090 20.8415 161.0569 514.0922 85.2504 64.0671 41.9991 14.7077 395.9716 9.6868 80.3597 146.1030 283.6821 58.6162 145.4276 263.8216 4.0418 25.9551 102.6405 896.0472 83.7020 24.2770 1152.0676 32.7081 373.6717 69.0296 37.5426 57.5580 13.2651 106.5106 3.5533 66.8557 281.3862 22.0152 7.5733 4.3436 1.4031 0.6233 3.5087 7.2032 1.9725 4.4031 26.2461 31.1908
temp: 298.150 k
press: 1.00000 atm
elementType: 17 9 9 9 9 9 8 8 8 7 7 7 6 6 6 6 6 6 6 6 6 6 6 6 6 6 6 6 6 6 6 6 1 1 1 1 1 1 1 1 1 1 1
symmnumber: 1
zpe: 728958.2 jmol-1
zpe.correction: 0.277646 hartree
zpe.thermalcorrener: 0.305962 hartree
zpe.thermalcorrenthalpy: 0.306906 hartree
zpe.thermalcorrgfe: 0.212268 hartree
zpe.sumelectzpe: -2115.685756 hartree
zpe.sumelectthermal: -2115.657439 hartree
zpe.sumelectthermalent: -2115.656495 hartree
zpe.sumelectthermalfe: -2115.751133 hartree
dipole: -4.3292 -4.5822 -2.2604
dipole: 6.6968
quadrupole: -134.3841 -195.0147 -193.0763
quadrupole: 46.4077 15.3726 -3.5878
quadrupole: 39.7743 -20.8563 -18.9180 46.4077 15.3726 -3.5878
hfenergy: -2115.9634011 hartree
pointgroup: C01 [X(C20H11Cl1F5N3O3)]
dipole: -1.6409431 1.3835086 -1.5280866 debye
polarizability: 505.2692976|-14.4784802|127.5159376|35.9390171|-48.5078112|263.6510579 unknown
InChI: InChI=1S/C20H11ClF5N3O3/c21-10-8-13(20(24,25)26)18(27-9-10)32-12-6-4-11(5-7-12)28-19(31)29-17(30)16-14(22)2-1-3-15(16)23/h1-9,28-29H
charge 0 multiplicity 1
43 atoms
Cl 8.318821 -0.884951 3.185566
F  7.899289 0.523094 -1.891585
F  6.032073 -0.54534 -2.601255
F  5.930004 1.637028 -1.995468
F  -7.493667 -0.607951 2.121933
F  -5.593294 0.277434 -2.263602
O  3.906286 0.010107 -0.690215
O  -2.366464 -0.855533 1.537751
O  -5.144729 -1.815769 1.240703
N  -1.74769 -0.234858 -0.653916
N  -4.004181 -0.230699 -0.069021
N  4.612566 -0.570844 1.517726
C  -0.32676 -0.204557 -0.562356
C  2.491198 -0.094422 -0.530081
C  6.228658 -0.016792 -0.230476
C  4.890027 -0.205569 0.244546
C  0.384976 -0.476465 0.634126
C  0.394561 0.1182 -1.744783
C  1.795427 -0.418429 0.654944
C  1.796936 0.172155 -1.731169
C  7.287508 -0.224637 0.670819
C  -6.465481 -0.239076 -0.047212
C  6.505698 0.390967 -1.651703
C  -2.661606 -0.490041 0.376767
C  -5.161734 -0.846338 0.448093
C  6.984597 -0.606757 1.994224
C  -7.610933 -0.202654 0.793387
C  -6.690448 0.247175 -1.357584
C  5.643396 -0.77072 2.38619
C  -8.870927 0.253167 0.368661
C  -7.921338 0.706553 -1.843187
C  -9.023862 0.702501 -0.960197
H  -0.164262 -0.740587 1.539251
H  -0.141406 0.330423 -2.678252
H  2.344004 -0.628178 1.572267
H  2.365647 0.418476 -2.631889
H  -2.129617 -0.112896 -1.595102
H  8.321871 -0.091142 0.345316
H  -4.137356 0.44956 -0.822283
H  5.379174 -1.065816 3.406399
H  -9.703188 0.254107 1.07706
H  -8.004343 1.052299 -2.87643
H  -9.999433 1.054372 -1.307459
