program: Gaussian 09
title: 000014251
version: EM64L-G09RevD.01
frameworkgroup: C1[X(C17H38N)]
method: RPBEPBE
basis: SDD
operation: Freq
keyword: #p
keyword: freq=noraman
keyword: PBEPBE/SDD
title: #p freq=noraman PBEPBE/SDD
converged: YES YES NO NO
title: Mulliken charges:
elementType: N C C C C C C C C C C C C C C C C C H H H H H H H H H H H H H H H H H H H H H H H H H H H H H H H H H H H H H H
charge: -0.110665 -0.353134 -0.412046 -0.375891 -0.389228 -0.388110 -0.388679 -0.387388 -0.556056 -0.554246 -0.544912 -0.386899 -0.385532 -0.382494 -0.373268 -0.353480 -0.356606 -0.693891 0.268396 0.267644 0.232044 0.229770 0.210388 0.209242 0.202829 0.203854 0.201350 0.201416 0.198965 0.198521 0.197392 0.197278 0.261442 0.276931 0.270018 0.274548 0.262108 0.269756 0.269379 0.269236 0.265172 0.196083 0.195854 0.194994 0.194877 0.193210 0.193319 0.190473 0.190461 0.188350 0.188345 0.195201 0.195205 0.209855 0.209843 0.218771
chargesum: 1.00000
title: Mulliken charges with hydrogens summed into heavy atoms:
elementType: N C C C C C C C C C C C C C C C C C
charge: -0.110665 0.182906 0.049768 0.043739 0.017456 0.014656 0.008806 0.007283 0.252335 0.252167 0.258874 0.005038 0.004339 0.004035 0.007666 0.023216 0.033800 -0.055420
polarizability: 2.58375345e+02 -6.33495972e-01 1.63886589e+02 3.82725542e-02 5.07459372e-02 1.57216844e+02
1716.lowfreq: -5.4525 -0.0024 0.0015 0.0020 6.6490 12.6316 17.0044 19.2444 36.3109
frequency: 16.4443 16.9285 36.3076 45.3430 50.9293 62.9741 66.1987 85.1692 93.5613 99.7903 110.2423 121.0615 125.4117 137.7112 144.5201 159.7414 161.7430 161.9803 196.1791 225.2433 230.5170 243.0932 260.2861 264.0461 298.2805 340.0057 349.2011 362.3652 405.0817 430.3192 433.9797 458.1946 488.9454 500.0529 521.9877 723.2549 724.7160 727.7644 728.0160 734.9227 746.8171 764.7824 791.8881 829.5668 857.0538 873.1915 887.9948 914.7896 936.2216 938.5873 969.4987 976.6747 983.6769 1004.5958 1007.4756 1020.2526 1034.9245 1037.2479 1042.8779 1054.5272 1059.0472 1073.0896 1077.6672 1079.0039 1080.4971 1081.8078 1085.4884 1115.5627 1126.6642 1153.7409 1181.4290 1197.0653 1200.9758 1215.9183 1216.9616 1232.0315 1236.5444 1245.3866 1253.5920 1255.8184 1274.1254 1275.0950 1280.9793 1287.3113 1289.4845 1295.2618 1296.5455 1299.5323 1302.8633 1306.1894 1316.7735 1320.4756 1334.2698 1346.1450 1352.6947 1354.7128 1357.9688 1358.0650 1366.8609 1390.5302 1420.4193 1421.5556 1446.0467 1452.1500 1458.4647 1461.0429 1461.1676 1463.4993 1463.7616 1465.7451 1466.1883 1467.1765 1469.4358 1470.6488 1474.4385 1476.8911 1478.4593 1482.3265 1485.0926 1485.5145 1487.1600 1489.5077 1490.9457 1501.2657 2951.2410 2951.5497 2953.0803 2954.0031 2955.8387 2957.9579 2960.7544 2964.0261 2967.4215 2970.2356 2972.6760 2973.8560 2984.6018 2987.7585 2991.7558 2993.1684 2996.6796 3002.6473 3009.8430 3013.1938 3017.8877 3023.7162 3026.2070 3027.7996 3031.1584 3034.3766 3041.4939 3046.9224 3058.5718 3069.9060 3073.7713 3090.3452 3139.8345 3140.5012 3144.0422 3146.1296 3154.6449 3158.2894
redmass: 3.9614 3.8934 3.5521 1.8099 3.6585 2.6175 1.6846 1.6184 2.3122 3.5569 1.7568 1.9494 4.2776 1.9882 1.8960 2.0356 2.0686 3.1493 1.2573 1.1353 3.2406 2.2374 1.2690 1.0854 3.0263 2.2130 3.0306 3.2112 2.7647 2.2742 2.9993 2.8939 2.8816 2.8947 2.9149 1.0589 1.0648 3.4870 1.1281 1.0912 1.1113 1.1488 1.1958 1.2375 3.4097 1.2789 1.9073 1.5133 1.7639 2.8075 1.2337 5.2885 4.7247 4.2684 1.1519 3.8080 3.5472 1.0721 1.1947 2.8298 3.0201 2.5703 2.2142 1.1953 2.1984 2.2147 2.2236 1.8372 2.7651 1.4103 1.9091 1.6676 1.2677 1.5376 1.5572 1.4071 1.4898 1.8504 1.3400 1.3880 1.2870 1.3118 1.0155 1.0463 1.1750 1.0670 1.3145 1.1182 1.1113 1.1051 1.3386 1.2278 1.3837 1.4529 1.5333 1.6876 1.5962 1.6297 1.3224 1.2162 1.1438 1.1449 1.0987 1.0461 1.1128 1.0735 1.0742 1.0699 1.0728 1.0623 1.0472 1.0752 1.0538 1.0803 1.0833 1.0423 1.0850 1.0865 1.0631 1.0671 1.0838 1.0955 1.0986 1.0595 1.0585 1.0585 1.0590 1.0590 1.0592 1.0592 1.0593 1.0591 1.0588 1.0590 1.0585 1.0362 1.0962 1.0971 1.0982 1.0584 1.0997 1.1013 1.1028 1.0579 1.1040 1.0323 1.1007 1.0364 1.0337 1.1047 1.1048 1.1046 1.1050 1.1007 1.0992 1.1079 1.1055 1.1057 1.1050 1.1052 1.1050 1.1045
irintensity: 1.6035 1.4183 0.0561 0.0326 0.0937 0.0509 0.0141 0.0771 0.0299 0.2113 0.0154 0.0377 3.5258 0.0036 0.0010 0.0022 0.0118 0.1268 0.1831 0.0009 0.0580 0.1848 0.4248 0.0831 0.2968 0.2050 0.1444 0.0071 0.0166 0.1276 0.2251 0.4710 0.6089 0.0029 1.8331 16.5598 2.0388 1.2151 9.1628 0.9011 5.5109 0.4803 2.6098 0.0765 56.7093 2.5618 4.8650 2.9849 10.0115 16.4999 0.1634 0.4272 0.9757 0.3404 0.4963 11.8210 0.5706 0.0083 0.0026 2.6495 1.2619 0.0689 0.8557 0.0073 0.3710 0.0160 0.7678 18.5077 5.1168 0.1568 0.0637 0.1138 30.6427 0.3861 0.0234 1.3641 0.0019 0.3266 2.5623 0.0063 0.1274 2.2504 1.2877 0.1043 0.2250 0.8977 2.4723 0.0025 0.0424 0.1173 3.1090 0.0689 1.8691 3.1792 1.0664 0.1243 0.1640 0.3661 3.5714 11.4034 19.4947 16.0950 1.9727 0.1170 9.0210 0.0113 0.5293 0.0629 1.2479 0.9603 0.4075 0.7647 2.0410 0.5172 2.9035 12.8639 1.3365 3.9394 35.1985 30.7390 23.5417 8.8144 48.9343 86.1129 0.0050 0.0944 0.1257 0.3011 1.0369 0.8426 2.5675 7.3853 39.8735 154.1673 155.1949 40.2623 0.0005 0.0011 0.0038 25.4073 0.0006 0.0053 0.0214 14.7223 0.5184 4.9758 0.1388 4.0011 2.8216 6.4374 27.0795 251.4056 68.1819 96.7381 51.8462 25.3325 0.6496 0.1074 4.4691 11.3227 0.8558 6.3169
temp: 298.150 k
press: 1.00000 atm
elementType: 7 6 6 6 6 6 6 6 6 6 6 6 6 6 6 6 6 6 1 1 1 1 1 1 1 1 1 1 1 1 1 1 1 1 1 1 1 1 1 1 1 1 1 1 1 1 1 1 1 1 1 1 1 1 1 1
symmnumber: 1
zpe: 1374306.6 jmol-1
zpe.correction: 0.523446 hartree
zpe.thermalcorrener: 0.548380 hartree
zpe.thermalcorrenthalpy: 0.549324 hartree
zpe.thermalcorrgfe: 0.465662 hartree
zpe.sumelectzpe: -723.573992 hartree
zpe.sumelectthermal: -723.549058 hartree
zpe.sumelectthermalent: -723.548113 hartree
zpe.sumelectthermalfe: -723.631776 hartree
dipole: -32.6851 -0.2259 0.0415
dipole: 32.6859
quadrupole: 140.7113 -111.4815 -108.6401
quadrupole: 2.6483 -0.3670 -0.0133
quadrupole: 167.1814 -85.0114 -82.1700 2.6483 -0.3670 -0.0133
hfenergy: -724.0974377 hartree
pointgroup: C01 [X(C17H38N1)]
dipole: 12.8588749 0.1382552 0.0138258 debye
polarizability: 258.3787505|-0.2635042|163.8770433|-0.1101847|0.2071447|157.2229842 unknown
InChI: InChI=1S/C17H38N/c1-5-6-7-8-9-10-11-12-13-14-15-16-17-18(2,3)4/h5-17H2,1-4H3
charge 1 multiplicity 1
56 atoms
N  7.478045 0.112941 0.007261
C  6.086672 -0.587572 -0.070817
C  4.859083 0.331004 0.003558
C  3.562993 -0.524433 -0.048318
C  2.283981 0.343473 -0.008046
C  0.989597 -0.500806 -0.037953
C  -0.294112 0.359463 -0.007797
C  -1.589159 -0.483731 -0.028044
C  7.639909 1.118249 -1.130001
C  7.646629 0.825557 1.347017
C  8.556756 -0.963078 -0.121853
C  -2.874726 0.373397 -0.00187
C  -4.169926 -0.469446 -0.018241
C  -5.456269 0.38661 0.007922
C  -6.751824 -0.455911 -0.006855
C  -8.03847 0.399675 0.019937
C  -9.334371 -0.443274 0.002618
C  -10.61421 0.419875 0.030886
H  6.076337 -1.316438 0.759727
H  6.091385 -1.14835 -1.0231
H  4.841326 1.043357 -0.84262
H  4.850584 0.918343 0.941154
H  3.550209 -1.232349 0.805325
H  3.557058 -1.138435 -0.97205
H  2.289745 0.970415 0.907482
H  2.283861 1.042827 -0.869421
H  0.982781 -1.196325 0.826821
H  0.982704 -1.134368 -0.949141
H  -0.294964 1.050939 -0.876024
H  -0.288671 0.998218 0.899962
H  -1.596271 -1.125393 -0.933846
H  -1.592408 -1.17333 0.841799
H  8.659016 1.533406 -1.096104
H  6.906322 1.92713 -1.010166
H  7.476623 0.604859 -2.08986
H  6.913824 1.64049 1.424707
H  8.66578 1.237858 1.40603
H  7.488476 0.101993 2.161241
H  8.440143 -1.690555 0.695862
H  8.443121 -1.47217 -1.090995
H  9.549804 -0.491697 -0.062639
H  -2.875561 1.061562 -0.872967
H  -2.869175 1.017018 0.902656
H  -4.177689 -1.113388 -0.922563
H  -4.171234 -1.157632 0.852884
H  -5.449823 1.031452 0.911651
H  -5.457443 1.074167 -0.863739
H  -6.752028 -1.143855 0.864586
H  -6.760003 -1.100514 -0.910825
H  -8.034035 1.043035 0.924816
H  -8.040351 1.088924 -0.850479
H  -9.33895 -1.084959 -0.9022
H  -9.332089 -1.13243 0.871794
H  -10.649602 1.046658 0.941971
H  -10.654826 1.097227 -0.843011
H  -11.525674 -0.205283 0.015877
