program: Gaussian 09
title: 000157862
version: EM64L-G09RevD.01
frameworkgroup: C1[X(C16H22O4)]
method: RPBEPBE
basis: SDD
operation: Freq
keyword: #pfreq=noraman
keyword: PBEPBE/SDD
title: #p freq=noraman PBEPBE/SDD
converged: YES YES NO NO
title: Mulliken charges:
elementType: O O O O C C C C C C C C C C C C C C C C H H H H H H H H H H H H H H H H H H H H H H
charge: -0.485519 -0.400963 -0.262676 -0.436819 0.356483 -0.518051 -0.515260 -0.208885 -0.445686 -0.469007 -0.204628 -0.403852 0.567549 0.142163 -0.705669 -0.463761 -0.378717 -0.347392 -0.411786 0.274749 0.225355 0.201746 0.199422 0.229636 0.196006 0.211164 0.219014 0.232601 0.211064 0.246365 0.240117 0.226738 0.353980 0.224649 0.217768 0.221606 0.232669 0.237172 0.246919 0.215415 0.376928 0.351392
chargesum: 0.00000
title: Mulliken charges with hydrogens summed into heavy atoms:
elementType: O O O O C C C C C C C C C C C C C C C C
charge: -0.131539 -0.024035 -0.262676 -0.085427 0.356483 -0.090950 -0.086202 -0.012879 -0.015508 -0.025342 0.041737 0.063003 0.567549 0.142163 -0.041645 -0.231093 -0.141544 -0.100473 -0.196371 0.274749
polarizability: 2.54282010e+02 -5.11211783e-01 1.36066227e+02 -7.55636711e+00 -3.93248172e+00 1.62730888e+02
1716.lowfreq: -13.4151 -9.4275 -1.7216 -0.0004 0.0004 0.0006 24.7393 28.0116 47.5858
frequency: 24.4340 27.9558 47.5562 60.9611 70.6270 86.4574 120.7534 134.5091 149.6678 186.1377 190.6911 206.1206 212.7336 258.8470 275.4448 282.1842 317.6552 347.7920 358.4127 378.5811 383.3259 390.6783 401.5290 410.7924 434.7489 472.4222 483.0488 533.8079 540.4962 549.7245 584.6540 622.0049 635.6095 666.3837 706.0632 730.6314 754.1576 768.6150 774.5578 788.7979 805.3863 815.3219 831.2667 846.5488 869.5678 909.1826 924.7643 927.8130 934.7686 955.2053 961.2111 972.5745 1003.5511 1019.2916 1051.8319 1057.0406 1062.6799 1082.6871 1088.8060 1096.3629 1106.5716 1136.6852 1140.6863 1143.8376 1147.5475 1180.4406 1205.9440 1215.9675 1226.2114 1233.3290 1245.0728 1258.8282 1264.4911 1282.5070 1294.3055 1301.3834 1317.6777 1326.0563 1327.5536 1340.4038 1344.6685 1356.8514 1364.1413 1390.2887 1393.0497 1397.0115 1427.8776 1445.1566 1453.6826 1457.0042 1468.3018 1471.4897 1478.9346 1484.0238 1502.3826 1597.5171 1622.1089 1625.6722 2946.9330 2962.4857 2974.2793 2978.8675 2990.5427 2993.8879 3002.8125 3021.8705 3028.6896 3049.8093 3052.7142 3056.2590 3061.4870 3077.7905 3083.1099 3106.9214 3120.9973 3136.9332 3167.1454 3426.5835 3487.1539 3581.9397
redmass: 4.2376 4.8314 5.2045 5.7766 2.8490 3.4360 4.4599 3.3868 3.9911 4.9091 2.7709 3.2009 1.8496 1.7764 3.9677 3.0791 3.9332 1.1153 4.3860 3.9128 2.5885 3.1760 3.3191 2.9078 3.1754 2.2744 3.3470 1.9753 1.8259 2.1708 3.3034 1.5408 6.9431 2.7330 2.6306 3.6390 2.0523 3.4107 1.6297 2.7739 1.3733 4.0238 1.5028 2.1188 2.9548 2.3774 1.8247 1.6367 1.5424 1.4460 2.2929 2.0781 2.8326 2.7557 2.4153 2.2609 1.9936 1.7124 1.8784 1.5522 2.0850 2.1550 1.6859 1.3854 2.4344 1.1095 1.6102 1.6005 1.2397 1.4090 2.8388 1.4975 1.3810 1.2677 1.5185 1.3218 1.3619 1.2846 1.2989 1.3881 1.3771 1.6712 1.7008 2.1857 2.8147 1.2069 2.6067 1.0888 1.0869 1.0952 1.0974 1.0615 1.0556 1.0585 2.7043 6.4309 7.0147 6.3966 1.0829 1.0601 1.0638 1.0359 1.0610 1.0617 1.0602 1.0964 1.0867 1.0993 1.1011 1.0998 1.1008 1.0992 1.1018 1.0879 1.0896 1.0953 1.0950 1.0657 1.0636 1.0660
irintensity: 0.7089 0.9145 1.0694 1.4454 0.3707 0.2745 0.7024 0.4620 0.0713 0.7485 1.3922 0.5502 2.2163 3.1340 3.2378 5.7431 3.5123 142.6958 5.1626 1.0433 8.2963 8.7041 3.8185 0.5278 9.5248 4.8483 3.0179 47.2276 118.7293 52.2383 35.4039 55.3150 0.7086 62.1402 65.7777 1.0899 9.9185 10.1094 0.4879 7.9100 27.4903 11.3812 44.4088 8.7439 3.8857 4.0420 13.4797 3.5080 6.4563 0.2426 13.0328 5.3164 6.3750 21.3712 54.4481 221.0008 30.6118 3.1282 37.8322 22.9223 11.4940 44.0540 24.4601 200.8799 22.3517 4.9078 4.4788 6.1161 20.6450 8.5718 32.1385 0.9685 6.4292 8.5668 19.4846 0.3238 5.0275 5.0723 13.1965 0.9975 5.6391 14.3569 24.2921 57.3873 4.2463 10.0734 16.8995 5.9889 7.0286 4.8309 8.1346 10.2180 11.3277 13.4158 113.2721 8.7403 146.7546 28.6083 22.0446 25.8749 46.5988 34.0934 35.4573 26.8898 11.2246 29.8463 11.7327 31.3794 8.5024 2.6491 46.0026 42.6834 48.5507 24.6752 16.6959 13.6999 8.6450 71.4983 21.7298 37.9973
temp: 298.150 k
press: 1.00000 atm
elementType: 8 8 8 8 6 6 6 6 6 6 6 6 6 6 6 6 6 6 6 6 1 1 1 1 1 1 1 1 1 1 1 1 1 1 1 1 1 1 1 1 1 1
symmnumber: 1
zpe: 920348.8 jmol-1
zpe.correction: 0.350542 hartree
zpe.thermalcorrener: 0.370491 hartree
zpe.thermalcorrenthalpy: 0.371435 hartree
zpe.thermalcorrgfe: 0.301351 hartree
zpe.sumelectzpe: -922.285125 hartree
zpe.sumelectthermal: -922.265177 hartree
zpe.sumelectthermalent: -922.264233 hartree
zpe.sumelectthermalfe: -922.334316 hartree
dipole: 2.2501 -0.2502 -0.7455
dipole: 2.3835
quadrupole: -116.0123 -118.0911 -116.8700
quadrupole: -0.6319 -15.9260 -0.3289
quadrupole: 0.9788 -1.0999 0.1212 -0.6319 -15.9260 -0.3289
hfenergy: -922.6356676 hartree
pointgroup: C01 [X(C16H22O4)]
dipole: 0.8819863 0.0622706 0.312393 debye
polarizability: 254.0771959|-0.9954171|137.1287827|8.6408663|-6.58022|161.8731457 unknown
InChI: InChI=1S/C16H22O4/c1-2-14(15(18)19)16(20)9-7-12(8-10-16)11-3-5-13(17)6-4-11/h3-6,12,14,17-18,20H,2,7-10H2,1H3
charge 0 multiplicity 1
42 atoms
O  1.764661 0.049957 -1.534181
O  4.776287 1.401243 1.259317
O  4.040877 1.642026 -0.919094
O  -6.788494 0.212121 -0.438724
C  1.831517 -0.206027 -0.081525
C  1.146994 0.953032 0.700507
C  1.055639 -1.524252 0.144059
C  -1.119393 -0.235862 0.621129
C  -0.350696 1.08808 0.353207
C  -0.447488 -1.382334 -0.18413
C  3.337561 -0.348749 0.373805
C  4.097482 -1.485802 -0.378417
C  -2.610524 -0.112733 0.319583
C  4.057226 0.968336 0.146216
C  5.602361 -1.562467 -0.04441
C  -3.581099 -0.290068 1.339682
C  -3.074733 0.182863 -0.988558
C  -4.962748 -0.179892 1.07796
C  -4.452474 0.29717 -1.271123
C  -5.397685 0.114449 -0.232828
H  1.663541 1.90845 0.480588
H  1.261981 0.765784 1.78854
H  1.184504 -1.835887 1.200986
H  1.489309 -2.313811 -0.494518
H  -1.008438 -0.473719 1.701819
H  -0.801296 1.911632 0.939407
H  -0.447049 1.354488 -0.716703
H  -0.55258 -1.178985 -1.266137
H  -0.964511 -2.339245 0.021341
H  3.362091 -0.557469 1.459123
H  3.946742 -1.346932 -1.464921
H  3.620629 -2.44468 -0.106077
H  2.396422 0.796209 -1.737283
H  6.147084 -0.664809 -0.390233
H  5.771679 -1.659007 1.044051
H  6.060298 -2.437998 -0.539125
H  -3.249931 -0.519608 2.360097
H  -2.35504 0.326672 -1.802985
H  -5.708837 -0.31745 1.866347
H  -4.787768 0.526047 -2.291752
H  5.238174 2.258517 1.04313
H  -6.986874 0.417909 -1.385768
