program: Gaussian 09
title: 000158055
version: EM64L-G09RevD.01
frameworkgroup: C1[X(C22H25ClO8)]
method: RPBEPBE
basis: SDD
operation: Freq
keyword: #p
keyword: freq=noraman
keyword: PBEPBE/SDD
title: #p freq=noraman PBEPBE/SDD
converged: NO YES NO NO
title: Mulliken charges:
elementType: Cl O O O O O O O O C C C C C C C C C C C C C C C C C C C C C C H H H H H H H H H H H H H H H H H H H H H H H H H
charge: -0.027871 -0.203158 -0.398858 -0.281380 -0.211059 -0.226526 -0.122372 -0.193358 -0.233642 -0.200525 0.225435 0.147809 -0.144125 0.155627 -0.455296 -0.612955 -0.576471 0.152920 -0.423943 0.126418 -0.523750 -0.186561 0.104545 -0.740357 -0.729750 0.472148 -0.395298 -0.355377 0.318220 -0.170670 -0.760928 0.196968 0.230556 0.251090 0.222356 0.262279 0.250995 0.242495 0.300872 0.298629 0.296399 0.255507 0.241728 0.229786 0.249869 0.214616 0.231139 0.248446 0.320072 0.364411 0.262665 0.280814 0.268387 0.258323 0.245292 0.247418
chargesum: 0.00000
title: Mulliken charges with hydrogens summed into heavy atoms:
elementType: Cl O O O O O O O O C C C C C C C C C C C C C C C C C C C C C C
charge: -0.027871 -0.203158 -0.034447 -0.281380 -0.211059 -0.226526 -0.122372 -0.193358 -0.233642 -0.003558 0.225435 0.147809 0.086430 0.155627 0.018151 -0.099680 -0.033105 0.152920 0.171085 0.126418 -0.026516 0.043225 0.104545 -0.044734 -0.161232 0.472148 -0.132634 -0.074564 0.318220 0.097717 -0.009895
polarizability: 3.23657879e+02 9.17982384e+00 2.42073370e+02 3.91599030e+00 -1.78074702e+01 2.18340800e+02
1716.lowfreq: -7.1617 0.0010 0.0015 0.0016 2.0954 7.1866 14.5275 23.9358 34.4245
frequency: 13.9378 23.8933 34.3942 35.5753 46.5193 49.0253 53.7851 65.6732 71.3049 86.5167 98.3271 104.5801 123.5068 130.2456 132.2013 152.3996 174.1617 180.0051 184.1267 199.2079 205.6725 210.9199 229.2525 231.6168 258.9795 276.3143 292.6023 304.4104 316.4580 324.9808 333.7316 341.2906 376.0898 381.1936 416.2434 422.1002 439.0646 453.6258 476.5965 493.1893 519.3825 535.1530 544.5140 549.0453 559.4106 582.0528 589.1269 607.2375 611.5101 628.0743 647.7352 649.9103 678.0664 687.6062 702.9384 707.0521 728.6798 732.1888 755.5364 787.9239 803.6196 826.8393 838.3252 849.8636 856.1516 863.2012 867.6944 876.2065 906.2181 911.4878 936.4030 942.4520 953.1520 957.3986 970.4972 985.2955 987.0331 999.3370 1002.1608 1007.4017 1017.5384 1022.2109 1043.2832 1045.5259 1057.3815 1064.5986 1077.5190 1081.5668 1085.0449 1104.2369 1115.0165 1126.4279 1134.1699 1142.2818 1159.7041 1163.4905 1179.9208 1187.4025 1190.2041 1202.0893 1219.8465 1233.1369 1240.3634 1258.2175 1259.8688 1272.8516 1275.8010 1278.9980 1285.4285 1294.8149 1310.7813 1317.2912 1328.5758 1340.0384 1349.0931 1351.3231 1367.2946 1375.4248 1384.5469 1400.6114 1402.2575 1443.2815 1443.6241 1454.2417 1456.5209 1460.8818 1467.3051 1472.7326 1481.6698 1483.0735 1484.9669 1498.2956 1585.6266 1609.7240 1657.8940 1661.9387 1663.0944 2953.2374 2961.4917 2987.2490 2988.2389 2999.4420 3001.1427 3005.9263 3025.8192 3029.5818 3034.6434 3056.6109 3065.7004 3078.1033 3082.2376 3082.4535 3086.9181 3088.9664 3100.2077 3110.5006 3139.8761 3154.3142 3225.0340 3252.4337 3273.4815 3477.4750
redmass: 5.7351 4.7162 8.2866 5.0055 4.7226 5.9362 7.1674 1.0755 5.6603 4.5556 7.7183 8.8950 5.0025 5.5790 5.9216 7.5212 4.9881 5.2465 5.1721 4.4895 6.0986 3.5606 2.3075 1.4408 5.9552 3.0191 3.6366 3.7764 4.6722 3.1149 5.0930 5.1273 3.5440 3.7829 4.2064 3.7785 3.2229 3.0577 3.4200 4.5886 3.8862 3.0011 1.2376 3.2598 3.1381 3.7436 3.8403 4.6306 4.2073 3.7516 5.0306 3.8236 5.0204 3.0402 4.0587 4.6097 4.2975 1.3665 5.2068 1.5975 3.1889 4.1929 2.3911 5.9557 2.3668 1.3987 2.6052 5.1252 1.7995 2.6284 2.3298 2.7779 1.9717 3.4892 3.2464 2.6664 2.9545 2.2246 2.4137 2.9477 2.9863 2.6658 1.6495 4.0388 2.5355 3.3893 2.7482 2.6508 2.5397 3.2665 2.8092 2.1736 2.8931 2.4147 1.6056 2.2306 1.8915 1.8613 3.0237 1.4052 1.2970 1.5214 1.3476 1.2059 1.5580 1.6181 1.2985 1.3129 1.2340 1.4116 1.2879 1.3713 1.3314 1.4220 1.7386 1.7134 1.2568 1.3418 1.2506 1.9039 1.4325 1.0972 1.1026 1.0557 1.0542 1.0883 1.0790 1.0734 1.0809 1.0689 4.2268 1.0686 6.0346 9.4509 10.7282 10.9722 10.3762 1.0835 1.0814 1.0361 1.0650 1.0604 1.0607 1.0382 1.0751 1.0730 1.0591 1.1001 1.0581 1.0991 1.1002 1.0978 1.1008 1.1013 1.0941 1.1059 1.1024 1.1075 1.0935 1.0994 1.1078 1.0645
irintensity: 0.2424 0.1582 1.0992 0.6265 1.9762 0.4346 1.9922 0.3551 1.4324 2.6512 0.3333 1.8722 3.9723 4.3956 0.6614 2.3781 1.7091 9.9039 3.4653 1.1586 0.2759 3.6422 1.1857 2.1544 0.2285 8.5099 9.2757 0.6628 17.2467 0.3730 2.0797 8.3809 5.0229 3.1558 0.6904 1.0449 3.4540 2.4684 0.5355 8.1620 0.9092 9.5099 166.2684 47.4697 3.9496 4.3207 14.2413 14.6905 6.5035 1.6263 12.1525 16.7762 5.6578 6.1966 24.5301 17.9596 6.4495 19.8238 15.1223 75.7412 18.3263 2.7535 3.5874 30.2044 18.4476 4.9314 17.0582 143.2831 36.4261 1.6677 17.5171 5.1947 3.1352 9.9075 6.8684 50.4509 22.1795 118.0269 20.4518 8.0719 38.8843 20.7343 10.9518 3.4214 31.5717 111.2481 28.8550 87.3718 58.2141 19.7163 14.6710 51.5627 22.8997 25.6666 6.4868 21.6299 46.6276 51.5633 397.6959 0.8179 1.3126 33.5897 7.2587 4.6651 12.3795 9.0126 6.7850 4.1913 7.4255 0.6067 14.9799 6.7832 12.1871 1.8635 7.1907 83.6994 9.3139 6.0268 57.6515 5.1121 14.9970 14.7955 17.5842 15.9129 19.6242 17.1995 16.2709 9.4538 15.2077 3.8224 24.9871 28.4897 11.7260 126.1410 56.2005 169.3888 301.0184 8.3496 22.8374 25.3754 7.3829 29.7303 6.1679 1.6563 13.5882 16.2991 6.7921 29.7528 23.0923 25.0793 21.9208 7.4651 13.7394 26.4081 7.5448 11.4884 9.1578 5.2940 0.7129 0.9544 0.1274 36.3445
temp: 298.150 k
press: 1.00000 atm
elementType: 17 8 8 8 8 8 8 8 8 6 6 6 6 6 6 6 6 6 6 6 6 6 6 6 6 6 6 6 6 6 6 1 1 1 1 1 1 1 1 1 1 1 1 1 1 1 1 1 1 1 1 1 1 1 1 1
symmnumber: 1
zpe: 1143748.0 jmol-1
zpe.correction: 0.435631 hartree
zpe.thermalcorrener: 0.465745 hartree
zpe.thermalcorrenthalpy: 0.466690 hartree
zpe.thermalcorrgfe: 0.372455 hartree
zpe.sumelectzpe: -1912.827995 hartree
zpe.sumelectthermal: -1912.797880 hartree
zpe.sumelectthermalent: -1912.796936 hartree
zpe.sumelectthermalfe: -1912.891171 hartree
dipole: 8.0332 0.8380 5.5877
dipole: 9.8212
quadrupole: -205.6804 -192.6217 -198.6389
quadrupole: 19.6108 -3.1869 -14.4702
quadrupole: -6.7001 6.3586 0.3415 19.6108 -3.1869 -14.4702
hfenergy: -1913.2636256 hartree
pointgroup: C01 [X(C22H25Cl1O8)]
dipole: 3.1920404 -0.0131647 2.1773632 debye
polarizability: 324.5586703|3.3320205|243.2498289|2.1008223|-16.5876472|216.2635497 unknown
InChI: InChI=1S/C22H25ClO8/c1-12-7-18(26)21(11-30-13(2)24)16(3-4-17(25)22(21,28)10-23)20(12)8-15(31-19(20)27)14-5-6-29-9-14/h5-6,9,12,15-16,28H,3-4,7-8,10-11H2,1-2H3
charge 0 multiplicity 1
56 atoms
Cl -3.347294 4.069221 1.181326
O  2.640887 -0.820472 -1.23207
O  -4.025669 0.911427 0.316385
O  -2.985958 -1.7119 -0.27726
O  -2.635953 -0.378451 2.478194
O  0.81602 -2.185048 -0.940566
O  -3.412197 2.29895 -1.89128
O  6.940212 0.641269 -0.630004
O  -3.703738 -2.164464 -2.447039
C  -0.147759 0.808205 0.159348
C  1.075782 -0.139745 0.507703
C  -1.613931 0.236128 0.320908
C  0.794558 -0.896898 1.861015
C  -2.675466 1.439778 0.30348
C  -0.02205 1.534765 -1.20412
C  2.375788 0.721099 0.620734
C  -0.606837 -1.573612 1.867815
C  -1.709736 -0.566517 1.640143
C  -1.994947 -0.75075 -0.833047
C  1.43353 -1.153967 -0.608577
C  -1.069446 2.675883 -1.333267
C  3.212692 0.459919 -0.66504
C  -2.488833 2.178804 -1.060548
C  1.86456 -1.949103 2.233864
C  -2.477467 2.419654 1.488864
C  4.686705 0.296665 -0.465482
C  5.367793 -0.667818 0.385151
C  5.675517 1.060732 -1.062922
C  -3.829754 -2.332801 -1.216949
C  6.721595 -0.431773 0.256687
C  -4.877434 -3.166123 -0.517019
H  -0.05318 1.589722 0.942527
H  0.795745 -0.111303 2.647795
H  -0.143935 0.818907 -2.039313
H  0.983411 1.980615 -1.310439
H  2.962408 0.421534 1.504144
H  2.156819 1.796938 0.72739
H  -0.783252 -2.075011 2.834507
H  -0.63644 -2.333871 1.063982
H  -1.129731 -1.335716 -1.178239
H  -2.458491 -0.232738 -1.689338
H  -1.051561 3.113267 -2.345557
H  -0.827899 3.483178 -0.612935
H  3.02572 1.23151 -1.43334
H  1.877223 -2.779971 1.505816
H  2.880241 -1.518237 2.291121
H  1.637932 -2.375633 3.227134
H  -1.430794 2.699697 1.673822
H  -2.932369 2.015402 2.402089
H  -4.107795 0.370206 1.149403
H  4.909545 -1.456109 0.979302
H  5.667804 1.885813 -1.769876
H  7.616526 -0.886179 0.67085
H  -5.756078 -2.529777 -0.303957
H  -4.500379 -3.559798 0.439484
H  -5.19884 -3.987801 -1.1747
