program: Gaussian 09
title: 000157758
version: EM64L-G09RevD.01
frameworkgroup: C1[X(C13H14BrN3O3)]
method: RPBEPBE
basis: SDD
operation: Freq
keyword: #p
keyword: freq=noraman
keyword: PBEPBE/SDD
title: #p freq=noraman PBEPBE/SDD
converged: YES YES NO NO
title: Mulliken charges:
elementType: Br O O O N N N C C C C C C C C C C C C C H H H H H H H H H H H H H H
charge: 0.056562 -0.201189 -0.398720 -0.207885 -0.093713 -0.414684 -0.052504 0.089745 -0.055793 0.089319 -0.733823 -0.735192 -0.735187 0.159499 -0.040924 0.313200 -0.222247 -0.339024 -0.125794 0.069937 0.226178 0.233310 0.245103 0.228469 0.235259 0.216586 0.234398 0.226389 0.213624 0.226869 0.348261 0.284227 0.271222 0.388523
chargesum: 0.00000
title: Mulliken charges with hydrogens summed into heavy atoms:
elementType: Br O O O N N N C C C C C C C C C C C C C
charge: 0.056562 -0.201189 -0.010197 -0.207885 -0.093713 -0.066422 -0.052504 0.089745 0.170385 0.089319 -0.026941 -0.048949 -0.068305 0.159499 -0.040924 0.313200 0.061980 -0.067802 -0.125794 0.069937
polarizability: 3.00325409e+02 6.36178103e+00 1.76125861e+02 3.38407685e+00 8.32576052e+00 1.15070686e+02
1716.lowfreq: -5.6771 -2.9555 -0.0009 -0.0007 -0.0006 2.6578 16.9118 40.9786 53.0439
frequency: 16.8879 40.9302 53.0311 62.8794 79.2824 102.6999 117.3766 126.2072 142.6967 161.1839 173.8266 197.6567 208.0475 217.0287 235.1655 259.2441 267.3885 276.1565 316.8250 318.6046 348.2931 360.3267 396.6293 413.4970 454.8954 464.8490 530.7617 550.8166 581.1182 589.6753 609.1673 618.7037 658.1296 671.9857 695.6178 702.2075 714.9865 741.4035 796.4393 805.3442 844.5339 876.6710 909.7614 911.9595 924.6659 930.6646 945.7321 957.7845 1010.7908 1042.6923 1058.2726 1081.5219 1098.6594 1101.7042 1129.3750 1150.0261 1171.7154 1191.2059 1209.0235 1232.1322 1258.0117 1304.0194 1308.9328 1313.5978 1317.7808 1371.6347 1377.1114 1383.1296 1388.2633 1397.4503 1445.8307 1459.2273 1468.4869 1474.7391 1480.1425 1488.2923 1496.9888 1530.2936 1558.7570 1575.3929 1648.7828 1675.7582 2979.6196 2984.2613 2987.2277 2997.8600 3073.5415 3076.9193 3080.7027 3086.2131 3093.1553 3117.4497 3160.5990 3171.3799 3514.5902 3566.5182
redmass: 6.2269 6.1005 7.4280 4.8566 2.8860 8.2609 5.8662 5.8810 7.3013 4.5733 5.5684 1.0814 2.7039 2.1402 1.0778 6.4982 4.6485 2.5555 4.3795 2.8655 4.3479 2.9743 4.7129 3.0242 4.4021 5.4608 3.4875 1.6337 4.3536 3.4588 6.4129 4.0884 7.5090 5.5654 1.9176 5.5102 2.9933 3.0248 7.2457 7.8991 2.7462 2.7792 2.2453 2.3849 1.1830 1.3921 2.0700 1.3989 5.7392 1.5497 2.4859 2.7607 2.9135 2.7435 2.4312 3.0215 2.2079 2.6722 4.1366 1.8592 2.2702 1.8217 1.5205 1.4089 5.3096 3.8148 1.2202 1.1979 2.3046 1.2100 4.2812 1.0627 1.0514 1.0516 1.0431 1.0535 1.0512 8.9421 6.8643 9.5352 9.9140 10.7019 1.0354 1.0364 1.0829 1.0351 1.0997 1.0999 1.0994 1.0996 1.0999 1.1002 1.0935 1.0941 1.0640 1.0802
irintensity: 0.2589 0.1360 0.0694 0.7397 0.2562 1.6188 0.7834 2.3949 1.6890 1.1943 3.2289 0.5303 0.8801 0.6069 0.1710 4.0911 0.4569 5.4449 3.0866 0.5956 3.0766 0.7657 4.6345 2.4659 10.1874 5.6845 17.1669 128.8793 19.3907 52.1399 6.1383 3.6494 20.5366 13.9798 25.9789 57.6998 31.3420 63.1959 4.9188 31.2015 7.9356 1.5611 31.2130 20.6418 2.8988 1.1342 3.1041 0.1309 117.6792 11.6243 92.2215 20.2363 40.0442 68.9156 28.0409 22.1148 12.8145 26.7219 41.0685 5.5540 22.5397 95.1085 30.2586 2.7556 10.4944 83.9024 8.5761 24.6213 142.4061 17.6914 87.3215 9.6713 4.6380 1.9552 17.4421 6.8982 7.6634 16.2458 7.7088 30.2400 221.3398 361.5820 24.5439 26.0260 10.7010 19.0984 11.3034 19.7472 53.7884 41.7883 30.2999 9.9996 6.7033 0.5639 35.8102 72.5986
temp: 298.150 k
press: 1.00000 atm
elementType: 35 8 8 8 7 7 7 6 6 6 6 6 6 6 6 6 6 6 6 6 1 1 1 1 1 1 1 1 1 1 1 1 1 1
symmnumber: 1
zpe: 666735.8 jmol-1
zpe.correction: 0.253946 hartree
zpe.thermalcorrener: 0.273846 hartree
zpe.thermalcorrenthalpy: 0.274790 hartree
zpe.thermalcorrgfe: 0.203849 hartree
zpe.sumelectzpe: -905.721244 hartree
zpe.sumelectthermal: -905.701345 hartree
zpe.sumelectthermalent: -905.700401 hartree
zpe.sumelectthermalfe: -905.771341 hartree
dipole: -1.8101 1.4513 -1.2468
dipole: 2.6339
quadrupole: -125.1559 -130.7266 -129.3141
quadrupole: 15.3163 1.3184 -6.5717
quadrupole: 3.2430 -2.3278 -0.9152 15.3163 1.3184 -6.5717
hfenergy: -905.9751906 hartree
pointgroup: C01 [X(C13H14Br1N3O3)]
dipole: 0.76699 -0.4783255 -0.5067048 debye
polarizability: 298.825351|14.7411449|178.5022719|5.1327434|-2.4625365|114.1943334 unknown
InChI: InChI=1S/C13H14BrN3O3/c1-6(2)13(3)12(20)16-10(17-13)9-8(11(18)19)4-7(14)5-15-9/h4-6,16,18H,1-3H3
charge 0 multiplicity 1
34 atoms
Br 5.87013 0.620347 0.196938
O  -3.199266 2.576125 -0.004544
O  0.593299 -2.306338 -1.257794
O  1.228296 -2.946258 0.890381
N  -1.125063 -0.419045 0.35846
N  -0.934455 1.840291 -0.039406
N  1.814072 1.703185 0.018306
C  -2.515394 0.158106 0.381478
C  -3.41019 -0.498588 -0.72915
C  -2.326656 1.680749 0.088329
C  -3.109198 -0.003243 1.802873
C  -2.793133 -0.315317 -2.137051
C  -3.683254 -1.99219 -0.440563
C  -0.30865 0.587014 0.114885
C  1.161309 0.497342 0.038462
C  1.857696 -0.74309 0.038448
C  3.269229 -0.716121 0.107113
C  3.170911 1.723844 0.038572
C  3.92624 0.530505 0.10936
C  1.177211 -2.084424 -0.011334
H  -4.368106 0.060285 -0.693213
H  -4.135408 0.403265 1.824414
H  -3.124207 -1.065843 2.091738
H  -2.502322 0.543092 2.545998
H  -1.820917 -0.83587 -2.212552
H  -3.469199 -0.735166 -2.903462
H  -2.638554 0.751287 -2.382349
H  -2.732846 -2.542062 -0.3148
H  -4.237546 -2.44298 -1.284049
H  -4.288547 -2.140647 0.470599
H  -0.420269 2.709573 -0.192963
H  3.834467 -1.651413 0.146784
H  3.655931 2.703857 0.004057
H  0.111389 -3.177673 -1.246265
