program: Gaussian 09
title: 000157713
version: EM64L-G09RevD.01
frameworkgroup: C1[X(C20H20O6)]
method: RPBEPBE
basis: SDD
operation: Freq
keyword: #pfreq=noraman
keyword: PBEPBE/SDD
title: #p freq=noraman PBEPBE/SDD
converged: YES YES NO NO
title: Mulliken charges:
elementType: O O O O O O C C C C C C C C C C C C C C C C C C C C H H H H H H H H H H H H H H H H H H H H
charge: -0.301239 -0.273916 -0.214471 -0.291903 -0.253871 -0.201017 -0.631093 -0.073400 0.487752 0.236069 -0.355852 -0.423701 0.261973 0.113834 -0.228054 -0.223354 -0.239413 0.297651 -0.220105 -0.312810 -0.362147 -0.239973 -0.198579 -0.672313 0.267235 -0.751086 0.234851 0.237335 0.283437 0.237570 0.232189 0.225742 0.224414 0.228047 0.268608 0.235565 0.228396 0.255949 0.234947 0.235997 0.214718 0.227815 0.233986 0.277940 0.240674 0.245603
chargesum: 0.00000
title: Mulliken charges with hydrogens summed into heavy atoms:
elementType: O O O O O O C C C C C C C C C C C C C C C C C C C C
charge: -0.301239 -0.273916 -0.214471 -0.291903 -0.253871 -0.201017 -0.158906 0.210037 0.487752 0.236069 -0.118282 -0.191512 0.261973 0.113834 -0.002313 0.001061 -0.011366 0.297651 0.243856 -0.044202 -0.106198 -0.005026 0.037417 0.004206 0.267235 0.013130
polarizability: 2.61482977e+02 1.44354480e+01 2.22805420e+02 -3.43006084e+01 -7.98243318e+00 2.15980438e+02
1716.lowfreq: -4.3860 -0.0011 -0.0010 -0.0006 2.5013 5.8604 9.3088 14.4575 15.5514
frequency: 9.0665 13.5941 15.5093 25.3558 35.2087 39.0489 52.8745 60.5855 74.6274 86.2756 95.2835 102.7157 112.6179 122.4897 132.0407 147.6596 172.5211 218.7721 234.7034 248.7234 257.9918 280.2428 304.1602 313.5879 323.0389 352.9530 390.5025 403.1832 412.9298 428.7287 442.5992 490.3910 498.9416 515.6475 533.6757 546.1193 566.0819 617.8846 634.8611 643.1936 659.9610 675.9785 702.6493 721.1218 729.2399 759.8456 773.7819 783.9099 795.5449 798.1260 810.8545 828.3219 845.6375 850.7792 876.2645 889.6310 910.1679 938.0456 969.8910 974.3808 986.2604 988.7373 991.1269 994.7813 997.3458 1024.0267 1027.0863 1030.1142 1037.1455 1039.5435 1055.7995 1088.1101 1111.9256 1117.4462 1135.6383 1138.0986 1153.5858 1172.5711 1173.5031 1189.1829 1192.3557 1195.9519 1218.5308 1234.6440 1249.8911 1257.8316 1270.5605 1317.0344 1326.0993 1335.1810 1357.2897 1376.1475 1383.9225 1385.2996 1400.6334 1431.6066 1441.8814 1449.7257 1454.2635 1461.4772 1463.5934 1470.9516 1473.6596 1484.9331 1486.1072 1576.1180 1594.5903 1608.4529 1615.4145 1625.7304 1653.0295 1695.1877 2996.5120 3007.1560 3009.6219 3012.9650 3044.0371 3072.2726 3073.5330 3093.2459 3103.8669 3108.9574 3114.5705 3126.4436 3138.3002 3139.9523 3143.9085 3149.4820 3157.8787 3164.7953 3174.4460 3187.3855
redmass: 4.5868 4.0570 4.3026 5.0728 4.3274 5.1262 3.2699 7.5698 3.4643 5.4874 3.8969 4.0793 1.1489 4.1530 4.0013 6.5814 4.4002 3.6655 5.7017 1.8144 3.3809 5.3741 4.1279 6.3140 3.1903 3.6984 4.0385 2.8261 4.6713 4.3374 3.8817 3.8110 4.3862 3.9155 4.4696 4.6057 4.6512 6.2983 5.6748 5.5560 5.9788 4.6776 1.8134 5.0634 4.0589 2.1628 4.1897 1.5394 4.2800 1.1179 4.1772 4.3785 3.5122 1.2679 3.4757 1.7756 1.7999 2.7196 1.3859 1.3994 2.2320 3.0587 3.5673 1.4558 1.3535 2.5115 2.5174 4.4403 1.7077 2.1928 3.3489 1.6845 2.3341 1.9852 1.4709 3.4864 2.9720 1.0579 1.0787 1.1299 1.8947 1.8067 2.4290 2.3164 1.1382 1.4812 1.4735 1.3949 1.3480 1.3382 1.3868 1.2430 7.8597 10.0786 1.2643 2.2706 2.1388 1.0591 1.0524 1.1180 1.0403 2.6347 1.0628 2.3012 1.0695 6.9171 6.0600 7.7849 6.1708 9.8366 11.1258 10.6684 1.0358 1.0607 1.0366 1.0582 1.0838 1.1066 1.1011 1.0985 1.0959 1.1029 1.0873 1.0861 1.0917 1.0866 1.1022 1.0959 1.0920 1.1015 1.0965 1.0966
irintensity: 0.1133 0.0554 1.3808 0.4743 0.8481 1.0118 0.6789 0.9596 4.3755 3.8969 0.2500 3.2714 0.0945 0.4236 2.1724 0.3728 1.9872 1.8822 5.0912 0.9231 0.6160 2.3815 3.9049 3.2514 7.2450 5.4337 16.9267 0.2145 2.7187 4.7948 3.2513 25.1442 4.9676 9.1387 2.7445 8.8888 3.4874 0.1712 9.9884 13.4445 8.7253 29.1095 52.0189 6.2605 29.8958 32.3566 3.7801 57.6359 16.5109 3.8101 4.0861 9.3105 33.5110 1.4834 36.8545 15.1453 5.5629 8.0213 3.3954 0.6869 96.1199 8.4489 1.1260 0.3964 0.1527 74.4065 73.1656 339.0256 0.8327 50.3445 74.5925 30.0759 20.5308 103.1253 6.3023 307.5259 412.7946 1.7395 14.1306 2.6204 19.2422 1.9700 5.0485 200.9173 1.3607 61.5958 17.3161 28.0165 14.2446 5.8876 0.5704 79.5869 0.4949 3.2065 23.1495 12.2340 6.6320 16.9169 21.0385 12.4338 12.0019 52.7931 6.1393 14.6248 14.0355 21.9658 1.9350 36.9272 4.9486 249.7748 143.7301 162.1690 20.2125 17.2917 1.4678 17.7900 2.6989 5.4325 10.7821 29.9916 6.9819 40.4972 7.9068 0.5205 17.5661 3.1981 9.2456 42.5992 15.4712 18.0224 10.4920 7.1971
temp: 298.150 k
press: 1.00000 atm
elementType: 8 8 8 8 8 8 6 6 6 6 6 6 6 6 6 6 6 6 6 6 6 6 6 6 6 6 1 1 1 1 1 1 1 1 1 1 1 1 1 1 1 1 1 1 1 1
symmnumber: 1
zpe: 934343.1 jmol-1
zpe.correction: 0.355873 hartree
zpe.thermalcorrener: 0.381607 hartree
zpe.thermalcorrenthalpy: 0.382552 hartree
zpe.thermalcorrgfe: 0.293811 hartree
zpe.sumelectzpe: -1223.596799 hartree
zpe.sumelectthermal: -1223.571065 hartree
zpe.sumelectthermalent: -1223.570120 hartree
zpe.sumelectthermalfe: -1223.658861 hartree
dipole: -1.4209 -0.8638 -0.7027
dipole: 1.8053
quadrupole: -123.4183 -143.5356 -143.3861
quadrupole: 9.2545 -6.6319 -9.3474
quadrupole: 13.3617 -6.7556 -6.6061 9.2545 -6.6319 -9.3474
hfenergy: -1223.952672 hartree
pointgroup: C01 [X(C20H20O6)]
dipole: 0.5902417 -0.375923 0.1214893 debye
polarizability: 264.458302|6.8608624|215.7828655|-35.465758|4.3601869|220.0276679 unknown
InChI: InChI=1S/C20H20O6/c1-3-24-20(23)18(13-15-9-5-4-6-10-15)26-19(22)16-11-7-8-12-17(16)25-14(2)21/h4-12,18H,3,13H2,1-2H3
charge 0 multiplicity 1
46 atoms
O  0.276936 -0.34568 0.67662
O  3.289375 -1.761851 -0.847056
O  1.497976 -2.820595 0.211993
O  -3.345945 -0.772905 -1.714009
O  -0.530204 -0.7184 -1.472052
O  -2.629715 1.451715 -1.946525
C  2.550276 0.375592 1.1562
C  1.641859 -0.332028 0.119563
C  2.30263 1.875242 1.2377
C  2.087041 -1.781077 -0.145907
C  1.206654 2.399014 1.970439
C  3.162581 2.778513 0.561905
C  -0.758593 -0.587648 -0.244985
C  -2.080211 -0.66424 0.434928
C  0.974615 3.79121 2.023421
C  2.93357 4.172356 0.613035
C  1.837293 4.683269 1.344849
C  -3.300609 -0.74657 -0.297322
C  3.871246 -3.099408 -1.193143
C  -2.149795 -0.721275 1.854475
C  -4.536034 -0.888382 0.364963
C  -3.381622 -0.858686 2.520915
C  -4.579641 -0.94728 1.773001
C  5.1670 -2.833569 -1.950772
C  -2.866411 0.350443 -2.466113
C  -2.733407 -0.047454 -3.911074
H  2.384578 -0.109179 2.13646
H  3.594831 0.179967 0.855623
H  1.643267 0.210305 -0.842905
H  0.529814 1.71169 2.489941
H  4.017342 2.388429 -0.005193
H  0.120392 4.179562 2.589338
H  3.608373 4.856478 0.086097
H  1.656588 5.763273 1.385469
H  -1.214785 -0.674797 2.417647
H  3.127269 -3.64677 -1.799094
H  4.032142 -3.658745 -0.253883
H  -5.446385 -0.949872 -0.238416
H  -3.409127 -0.90511 3.614201
H  -5.542955 -1.059439 2.281905
H  5.633842 -3.793298 -2.238064
H  5.883738 -2.272993 -1.326543
H  4.974335 -2.25284 -2.868733
H  -1.809249 -0.645205 -4.008441
H  -2.658128 0.848122 -4.544685
H  -3.579245 -0.678684 -4.227274
