program: Gaussian 09
title: 000157957
version: EM64L-G09RevD.01
frameworkgroup: C1[X(C31H18N2O8)]
method: RPBEPBE
basis: SDD
operation: Freq
keyword: #p
keyword: freq=noraman
keyword: PBEPBE/SDD
title: #p freq=noraman PBEPBE/SDD
converged: YES YES NO NO
title: Mulliken charges:
elementType: O O O O O O O O N N C C C C C C C C C C C C C C C C C C C C C C C C C C C C C C C H H H H H H H H H H H H H H H H H H
charge: -0.234308 -0.234264 -0.322793 -0.322921 -0.185563 -0.185676 -0.196621 -0.196417 0.001399 0.001401 -0.711264 0.421226 0.421097 0.222964 0.222604 0.027031 0.027322 0.169365 0.169470 -0.373098 -0.373054 0.111754 0.111875 -0.338349 -0.338352 -0.272512 -0.272467 -0.212468 -0.212486 0.154284 0.154397 0.269920 0.269990 -0.260299 -0.260314 -0.399469 -0.399497 -0.180122 -0.180132 -0.325543 -0.325554 0.253707 0.253717 0.227004 0.227006 0.271841 0.271849 0.236172 0.236168 0.240849 0.240861 0.278927 0.278923 0.279099 0.279063 0.240392 0.240392 0.250737 0.250737
chargesum: 0.00000
title: Mulliken charges with hydrogens summed into heavy atoms:
elementType: O O O O O O O O N N C C C C C C C C C C C C C C C C C C C C C C C C C C C C C C C
charge: -0.234308 -0.234264 -0.322793 -0.322921 -0.185563 -0.185676 -0.196621 -0.196417 0.001399 0.001401 -0.203840 0.421226 0.421097 0.222964 0.222604 0.027031 0.027322 0.169365 0.169470 -0.146094 -0.146049 0.111754 0.111875 -0.066507 -0.066503 -0.036340 -0.036299 0.028381 0.028376 0.154284 0.154397 0.269920 0.269990 0.018629 0.018609 -0.120370 -0.120434 0.060270 0.060260 -0.074807 -0.074817
polarizability: 5.85051347e+02 2.89826362e+01 3.14297348e+02 1.70148733e-02 2.00638159e-02 2.62875525e+02
1716.lowfreq: -4.9320 0.0005 0.0007 0.0009 1.3460 6.8376 13.3202 16.7889 20.8319
frequency: 13.2987 16.5152 20.8306 21.9708 25.2504 28.7532 37.0316 41.2907 45.4017 58.9916 67.1200 77.4719 94.3296 98.4571 103.6329 117.1646 137.6024 152.5737 156.8268 161.2458 162.6492 179.7150 249.9654 264.0824 266.5989 266.9016 298.3249 303.4723 319.4181 328.3638 332.3043 345.6742 346.9150 373.0584 373.3607 414.2960 416.6570 426.4551 427.7830 431.4755 438.8960 454.6557 456.1425 485.6993 491.5441 493.3491 508.0904 540.4856 542.7224 576.7251 602.7874 606.9385 610.6138 613.3233 623.2802 646.2486 658.4125 662.9550 668.6707 669.2315 689.2149 691.2436 694.7011 715.3350 715.4693 726.4200 726.8411 740.3943 749.7784 767.6982 772.6815 774.6876 781.9727 825.2631 832.5128 832.6137 850.9770 861.0333 867.1038 868.0045 900.2349 939.1896 939.2114 945.0917 950.7297 951.2777 953.7105 966.6511 967.6517 967.6842 988.2582 989.4994 989.6600 1004.6034 1005.0640 1005.1791 1013.9287 1020.5008 1030.8391 1032.9927 1035.5241 1039.9712 1041.2205 1067.1801 1109.7387 1109.7452 1129.8039 1140.2447 1158.8009 1159.2582 1186.0080 1187.6410 1196.3321 1196.3414 1205.9904 1214.5020 1220.0003 1241.6156 1245.2149 1271.3483 1283.9101 1312.1379 1312.1658 1313.4285 1329.1723 1329.2074 1350.7782 1355.2412 1396.3303 1397.3358 1409.3667 1409.4446 1436.8887 1437.5759 1454.7718 1454.7744 1457.2276 1480.0336 1486.6218 1550.3806 1550.4010 1560.4665 1560.6048 1584.8535 1584.9839 1610.2060 1612.1743 1612.9254 1615.4850 1650.9166 1651.3132 1672.3840 1674.7460 3034.0455 3082.1344 3136.6769 3136.6899 3142.1572 3142.2012 3154.2522 3154.2774 3154.3421 3154.3646 3166.5679 3166.6477 3169.2578 3169.3082 3175.5003 3175.5224 3183.3965 3183.4144
redmass: 6.7623 6.5898 5.9221 8.4193 6.9204 5.9901 6.4288 5.9531 7.3125 8.0688 7.9135 5.4840 6.5789 7.4027 7.5398 7.8130 6.6531 6.7243 5.6535 5.9308 5.7325 7.8725 5.9340 6.6156 5.7513 6.6561 2.7250 6.0115 6.0048 8.8808 6.1907 6.4848 7.3473 3.2123 3.2378 6.6745 6.5297 5.1955 5.8305 7.0275 7.3328 4.5893 4.2812 5.5304 7.8831 9.1400 4.5554 4.0029 7.8117 4.0831 8.3385 7.6244 7.7169 6.5859 8.0498 7.5048 7.7009 6.5951 8.7973 8.9150 8.2550 8.2863 6.2442 1.8622 1.8574 6.4534 6.1826 3.6171 2.3747 1.3639 1.8685 7.0877 9.0485 4.5311 1.7201 1.7257 6.5748 6.4679 1.5264 1.4919 7.0238 1.3941 1.3956 7.5960 1.8170 1.4056 3.5922 3.9496 1.5005 1.4998 6.3798 1.3406 1.3377 3.0955 1.3883 1.5477 4.8094 5.7099 2.8597 2.8840 2.2606 2.0139 4.9081 4.2224 1.6035 1.6020 1.7457 1.8361 2.2874 2.9714 1.4100 1.5702 1.3551 1.3501 1.6361 3.2659 2.3479 2.7922 2.6887 1.7479 1.5415 11.1849 11.3086 1.3933 1.2516 1.2517 3.2868 3.5119 9.3779 9.1730 2.1405 2.1392 2.4898 2.5502 2.1011 2.1250 1.1865 2.9101 2.5418 5.8085 5.8087 6.5466 6.4808 5.8939 5.8974 9.5076 7.8982 6.8571 7.4733 12.6288 12.5942 12.5271 12.5520 1.0589 1.0993 1.0890 1.0890 1.0856 1.0855 1.0906 1.0906 1.0911 1.0911 1.0929 1.0929 1.0956 1.0956 1.1003 1.1003 1.0992 1.0992
irintensity: 0.0903 0.5555 1.3065 0.5443 0.0688 1.0082 2.3948 4.5185 0.1198 2.4548 0.0212 0.0876 0.1174 0.2347 1.5965 0.1426 0.4324 0.1534 0.6845 0.1970 1.4248 0.0022 8.7271 0.0604 1.7036 0.3202 6.2917 14.9770 1.7280 0.1892 6.2995 4.7606 0.0170 2.1555 0.3167 0.0129 0.1055 4.2949 5.2329 0.4986 11.8317 6.0789 13.1095 1.6757 3.2128 0.1881 3.5542 0.0161 12.4132 0.5463 2.3772 5.5732 4.5537 4.2169 1.2596 10.5483 0.4473 0.2179 2.8908 20.9253 0.6126 40.5006 0.0353 52.3200 53.7996 16.0160 2.2625 22.5956 38.6057 54.7590 56.3598 42.4882 0.3396 17.5157 23.1105 15.8307 3.5299 7.7108 2.1730 6.2847 3.2171 1.6263 3.1572 35.0539 0.4334 10.8966 2.1517 331.3169 1.1329 1.9466 39.3130 1.4675 5.2234 98.8847 0.2367 32.9060 0.0246 350.6901 0.2912 517.4111 0.4969 22.8764 23.0454 144.0820 21.7366 4.7407 6.3139 39.6010 1.0999 143.5705 47.8749 0.2176 1.1368 8.9244 8.9766 277.0285 24.8399 345.0111 18.8417 1.3644 6.2553 8.4486 0.8458 22.4585 1.8412 0.6686 1.9198 113.1077 14.4728 4.0867 60.0139 1.4415 16.2835 41.8172 7.2398 9.3653 23.0061 9.5169 8.3566 5.0473 1.5094 10.7262 5.2027 91.9061 16.2017 36.9904 41.6650 148.4954 16.0634 157.3848 266.3968 596.6598 201.9974 5.6930 7.3532 17.4388 5.3791 1.0687 1.2201 5.8627 6.3682 18.7961 7.6628 17.8982 8.2436 11.1385 16.0255 27.4822 2.4196 10.4873 5.6134
temp: 298.150 k
press: 1.00000 atm
elementType: 8 8 8 8 8 8 8 8 7 7 6 6 6 6 6 6 6 6 6 6 6 6 6 6 6 6 6 6 6 6 6 6 6 6 6 6 6 6 6 6 6 1 1 1 1 1 1 1 1 1 1 1 1 1 1 1 1 1 1
symmnumber: 1
zpe: 1095392.9 jmol-1
zpe.correction: 0.417213 hartree
zpe.thermalcorrener: 0.450656 hartree
zpe.thermalcorrenthalpy: 0.451600 hartree
zpe.thermalcorrgfe: 0.346886 hartree
zpe.sumelectzpe: -1900.593694 hartree
zpe.sumelectthermal: -1900.560251 hartree
zpe.sumelectthermalent: -1900.559307 hartree
zpe.sumelectthermalfe: -1900.664021 hartree
dipole: 0.0042 0.0050 7.2242
dipole: 7.2242
quadrupole: -155.4560 -262.1907 -241.9304
quadrupole: 7.9165 0.0120 -0.0236
quadrupole: 64.4031 -42.3317 -22.0714 7.9165 0.0120 -0.0236
hfenergy: -1901.0109067 hartree
pointgroup: C01 [X(C31H18N2O8)]
dipole: 0.0010572 0.0027448 2.8422078 debye
polarizability: 587.9247338|-7.3310746|311.4239277|0.1169273|-0.0015826|262.8755596 unknown
InChI: InChI=1S/C31H18N2O8/c34-28(18-7-5-13-32-16-18)40-26-22(20-9-1-3-11-24(20)38-30(26)36)15-23-21-10-2-4-12-25(21)39-31(37)27(23)41-29(35)19-8-6-14-33-17-19/h1-14,16-17H,15H2
charge 0 multiplicity 1
59 atoms
O  -1.730118 -3.306016 -0.48032
O  1.72707 3.310016 -0.480823
O  1.465014 -1.444339 -0.133805
O  -1.466144 1.445732 -0.131176
O  0.315685 -3.634386 -1.495553
O  -0.319187 3.635066 -1.496036
O  2.312463 -3.311915 1.004385
O  -2.314647 3.317534 0.999391
N  5.094993 -0.557239 -1.915845
N  -5.092513 0.556969 -1.919622
C  0.001301 0.000658 1.827918
C  -0.642853 -1.115647 1.011135
C  0.643119 1.118253 1.011081
C  -2.044411 -1.496046 1.176739
C  2.044425 1.500039 1.175643
C  0.127967 -1.836533 0.121891
C  -0.12929 1.838968 0.12308
C  -2.543736 -2.595627 0.413696
C  2.542119 2.600234 0.412433
C  -2.962038 -0.846271 2.054006
C  2.963335 0.851241 2.05227
C  -0.349919 -2.969702 -0.682424
C  0.347353 2.972116 -0.682206
C  -3.880433 -3.032792 0.505363
C  3.878423 3.038755 0.503104
C  -4.294721 -1.275918 2.159742
C  4.295662 1.282265 2.157082
C  -4.757356 -2.370738 1.382601
C  4.756694 2.377525 1.379626
C  2.507253 -2.362653 0.221634
C  -2.508512 2.366243 0.218976
C  3.793288 -1.983653 -0.411849
C  -3.793493 1.985882 -0.415707
C  4.951537 -2.737406 -0.090088
C  -4.952403 2.739915 -0.096913
C  3.913246 -0.909522 -1.334322
C  -3.911752 0.910401 -1.336798
C  6.176263 -2.386174 -0.689358
C  -6.176096 2.387532 -0.697599
C  6.201121 -1.291619 -1.587372
C  -6.199318 1.291559 -1.593935
H  0.754918 -0.459305 2.488431
H  -0.750245 0.459251 2.491742
H  -2.631951 0.004093 2.658424
H  2.634604 0.000714 2.657219
H  -4.202321 -3.875414 -0.112482
H  4.198928 3.881764 -0.114934
H  -4.979428 -0.760458 2.840382
H  4.981297 0.767457 2.837282
H  -5.798228 -2.700272 1.461206
H  5.797301 2.708064 1.457451
H  4.866986 -3.576519 0.608109
H  -4.869099 3.580135 0.6001
H  3.035488 -0.323091 -1.619846
H  -3.033357 0.323887 -1.620213
H  7.092866 -2.943366 -0.474442
H  -7.093136 2.944906 -0.485036
H  7.134885 -0.984459 -2.072128
H  -7.132295 0.983307 -2.079512
