program: Gaussian 09
title: 000157649
version: EM64L-G09RevD.01
frameworkgroup: C1[X(C13H14O5)]
method: RPBEPBE
basis: SDD
operation: Freq
keyword: #pfreq=noraman
keyword: PBEPBE/SDD
title: #p freq=noraman PBEPBE/SDD
converged: YES YES NO NO
title: Mulliken charges:
elementType: O O O O O C C C C C C C C C C C C C H H H H H H H H H H H H H H
charge: -0.301596 -0.274324 -0.280463 -0.264840 -0.202796 0.370570 0.054383 0.090591 0.249952 -0.564299 0.255292 0.401672 -0.512022 0.135802 -0.794914 -0.756792 -0.499076 -0.535728 0.280057 0.270972 0.235869 0.235189 0.274869 0.216282 0.245648 0.265782 0.228451 0.223537 0.257182 0.223226 0.225410 0.246115
chargesum: 0.00000
title: Mulliken charges with hydrogens summed into heavy atoms:
elementType: O O O O O C C C C C C C C C C C C C
charge: -0.301596 -0.274324 -0.280463 -0.264840 -0.202796 0.370570 0.054383 0.090591 0.249952 -0.284243 0.255292 0.401672 -0.241050 0.135802 -0.048987 -0.029080 0.210093 0.159022
polarizability: 2.66277862e+02 2.84951779e+00 1.82680998e+02 -1.25832927e+00 -1.46812141e+00 8.30137202e+01
1716.lowfreq: -8.7925 -4.5733 -0.0007 -0.0006 -0.0004 6.0470 21.1980 37.2953 42.2392
frequency: 21.0786 37.2831 42.1668 60.4707 90.1455 107.3533 124.5277 131.1082 157.3493 172.3623 185.7705 203.1862 222.7529 236.2713 252.5675 292.5432 298.2282 312.3634 334.2615 352.0614 386.0809 417.7511 442.4649 495.2383 501.1636 516.9428 555.6546 570.0314 588.8242 614.6434 655.8014 685.0896 694.3902 705.6620 818.0137 820.6233 840.0100 872.5149 895.9371 938.0687 953.1828 974.5910 989.4173 1019.5052 1051.1585 1076.2093 1107.4222 1113.0000 1113.1207 1131.2736 1155.4280 1165.2550 1167.1000 1191.3639 1212.3455 1273.5643 1325.7383 1385.9965 1393.3516 1401.7255 1421.4415 1432.3316 1448.4549 1450.8955 1456.6528 1458.1077 1459.5970 1465.1761 1467.0904 1469.2557 1475.4070 1482.0614 1592.3595 1612.1783 1632.1938 1652.9690 2963.1276 2972.6297 2980.7486 2997.1603 3040.6824 3051.8027 3060.7526 3106.7404 3111.6514 3127.9741 3132.5496 3133.7886 3187.3014 3195.1859
redmass: 2.9233 3.5562 1.4509 3.6203 3.4893 2.1274 3.1476 1.3680 3.2937 2.4841 3.2683 1.9787 2.0243 3.6877 1.7027 4.5280 4.1189 3.9427 4.5908 6.6778 4.4861 3.9762 5.0585 4.3417 4.9268 5.6819 4.7287 7.7364 8.8693 4.6718 6.5498 3.0660 6.1544 7.7314 4.3931 1.6686 1.7926 7.2647 4.9276 7.6061 1.2768 2.3577 1.7099 2.7666 4.8269 1.6592 1.3309 1.3297 2.2724 2.9167 1.4096 1.7069 2.5103 5.3908 1.5548 5.3433 6.6981 1.2044 5.3982 1.1979 3.8545 1.3158 1.1185 1.3702 1.0724 1.0535 1.0836 1.0519 1.0549 1.3949 1.0508 1.8019 8.7495 6.6604 8.6042 9.2336 1.0328 1.0398 1.0409 1.0309 1.0959 1.1040 1.0929 1.1019 1.0990 1.0997 1.0963 1.1060 1.0911 1.0930
irintensity: 3.1813 3.3670 1.4812 4.6007 3.0674 1.6759 1.0165 0.2349 1.3258 1.4549 2.6558 2.7044 1.1033 1.5322 0.6823 1.9732 0.4504 1.8171 9.3381 0.7038 3.2195 4.9100 4.5160 8.6190 5.0181 7.3242 1.2092 4.3342 0.4870 6.8306 1.1450 4.8670 5.3599 1.8021 13.0049 8.5570 72.2176 1.2328 57.9465 55.9325 0.7081 23.4320 114.1588 62.5773 99.8430 28.2721 1.6425 6.2392 53.7397 88.7837 36.0080 63.7654 296.2307 468.0771 84.0029 60.9607 13.7005 41.7595 49.4178 21.9431 37.2296 67.9415 25.9059 9.5043 15.6785 13.0464 1.6131 34.1577 17.8701 166.3628 19.7550 45.9898 189.7941 293.0407 30.7758 230.6263 71.3317 15.4235 31.8046 53.5482 14.2138 45.8945 24.6507 35.8195 10.6543 24.3791 7.2086 23.9522 1.3434 0.3738
temp: 298.150 k
press: 1.00000 atm
elementType: 8 8 8 8 8 6 6 6 6 6 6 6 6 6 6 6 6 6 1 1 1 1 1 1 1 1 1 1 1 1 1 1
symmnumber: 1
zpe: 639330.9 jmol-1
zpe.correction: 0.243508 hartree
zpe.thermalcorrener: 0.262098 hartree
zpe.thermalcorrenthalpy: 0.263042 hartree
zpe.thermalcorrgfe: 0.195525 hartree
zpe.sumelectzpe: -878.512678 hartree
zpe.sumelectthermal: -878.494088 hartree
zpe.sumelectthermalent: -878.493144 hartree
zpe.sumelectthermalfe: -878.560661 hartree
dipole: 0.9642 -1.4918 1.4835
dipole: 2.3143
quadrupole: -84.4772 -104.6067 -106.3828
quadrupole: 9.2138 -0.8567 2.4552
quadrupole: 14.0117 -6.1178 -7.8939 9.2138 -0.8567 2.4552
hfenergy: -878.7561862 hartree
pointgroup: C01 [X(C13H14O5)]
dipole: 0.3463826 0.6487957 -0.5367619 debye
polarizability: 266.2905904|2.0890952|182.3363731|2.6175821|5.7046501|83.3456164 unknown
InChI: InChI=1S/C13H14O5/c1-7(2)11-13(14)18-12-9(16-4)5-8(15-3)6-10(12)17-11/h5-6H,1-4H3
charge 0 multiplicity 1
32 atoms
O  -1.083061 1.16022 0.35274
O  -0.542673 -1.616694 0.143366
O  2.297037 -2.418232 -0.220799
O  3.56368 2.248786 0.137357
O  -2.766978 -2.106865 0.125244
C  0.243455 0.715098 0.191736
C  0.515912 -0.665609 0.048193
C  -2.164135 0.256422 0.074179
C  1.856937 -1.100651 -0.094521
C  1.259711 1.674997 0.217756
C  -3.398756 0.821851 -0.149149
C  2.600212 1.232139 0.096194
C  2.899483 -0.137685 -0.067999
C  -1.906276 -1.202643 0.115214
C  -3.561664 2.326254 -0.155344
C  -4.660802 0.01382 -0.370669
C  1.383175 -3.488975 -0.672636
C  4.96942 1.851626 0.024025
H  1.029524 2.735608 0.33167
H  3.919603 -0.510353 -0.180498
H  -4.309918 2.626645 0.604526
H  -3.959313 2.658367 -1.134281
H  -2.619807 2.854659 0.046809
H  -5.411722 0.631585 -0.893893
H  -5.099277 -0.298992 0.597543
H  -4.481422 -0.91371 -0.935699
H  2.048488 -4.342697 -0.872282
H  0.854118 -3.192544 -1.595719
H  0.646356 -3.739977 0.10533
H  5.170945 1.361022 -0.947979
H  5.262965 1.174915 0.849622
H  5.538482 2.790211 0.091565
