program: Gaussian 09
title: 000157654
version: EM64L-G09RevD.01
frameworkgroup: C1[X(C21H25NO4)]
method: RPBEPBE
basis: SDD
operation: Freq
keyword: #p
keyword: freq=noraman
keyword: PBEPBE/SDD
title: #p freq=noraman PBEPBE/SDD
converged: YES YES NO NO
title: Mulliken charges:
elementType: O O O O N C C C C C C C C C C C C C C C C C C C C C H H H H H H H H H H H H H H H H H H H H H H H H H
charge: -0.245428 -0.278955 -0.246615 -0.258012 -0.254259 0.135789 0.500009 -0.747623 -0.700326 -0.696873 -0.417591 -0.417636 0.247939 -0.401157 -0.357933 0.078125 0.300686 -0.650971 0.219902 -0.289888 -0.314437 -0.245332 -0.227248 0.293855 -0.266088 -0.663082 0.216513 0.217083 0.218932 0.216304 0.209062 0.222547 0.208119 0.214744 0.226180 0.249218 0.228824 0.258238 0.258369 0.261942 0.255019 0.236216 0.270874 0.300068 0.231222 0.231549 0.230170 0.237981 0.251712 0.230346 0.221917
chargesum: 0.00000
title: Mulliken charges with hydrogens summed into heavy atoms:
elementType: O O O O N C C C C C C C C C C C C C C C C C C C C C
charge: -0.245428 -0.278955 -0.246615 -0.258012 -0.254259 0.135789 0.500009 -0.095094 -0.052413 -0.047830 -0.168373 -0.188812 0.247939 -0.142919 -0.099564 0.078125 0.300686 0.102206 0.219902 -0.019014 -0.014369 -0.014110 0.004301 0.293855 0.202063 0.040892
polarizability: 3.37501960e+02 -2.44889821e+01 2.84444908e+02 -5.49900849e+00 3.17390936e+00 1.50481905e+02
1716.lowfreq: -0.0008 0.0001 0.0003 2.1405 3.7664 5.7429 16.1223 18.9711 28.3626
frequency: 16.0598 18.8282 28.3529 35.1707 45.6076 51.1944 72.5725 78.4093 83.8695 98.2074 106.5767 132.6472 157.3116 165.2766 178.7176 203.0150 214.5695 222.3784 238.4737 247.0599 266.8052 269.3671 281.0951 299.9163 311.2000 318.2945 324.5961 341.7741 349.2684 365.8245 387.6198 410.5558 421.2689 442.8147 454.6001 471.5515 474.3342 540.2189 545.5711 569.2670 593.8200 600.7833 632.4347 653.2970 664.3005 680.6416 697.4783 721.1094 736.4114 760.5352 766.8607 772.3411 796.4981 823.4353 829.9596 838.3577 857.3627 859.5026 872.8184 920.2687 929.9364 943.1009 947.6642 951.4420 973.0658 983.5630 986.1657 1005.7957 1020.1285 1024.7610 1024.8399 1031.3006 1045.8756 1081.8262 1095.0258 1110.3130 1113.8089 1124.9788 1126.1134 1154.6491 1162.0797 1170.8210 1188.1795 1194.0458 1204.4222 1206.0538 1217.2246 1252.2399 1272.4738 1279.5162 1283.4748 1310.0724 1348.2219 1357.8856 1359.6963 1373.3409 1375.8504 1376.7402 1392.9518 1403.4773 1405.9879 1430.5144 1441.6743 1458.3466 1459.0294 1463.5107 1467.3758 1467.5541 1469.2361 1478.2041 1482.7809 1484.4599 1487.9396 1495.4915 1500.3712 1506.4434 1550.3717 1574.3169 1593.4285 1602.9449 1616.6397 1631.7165 2972.7632 2973.6072 2978.6364 2988.2373 2995.1877 3034.0866 3067.3572 3068.5515 3071.5098 3072.7295 3076.7270 3079.0352 3082.3782 3090.2159 3097.9010 3122.6121 3124.3652 3124.7368 3139.5716 3142.5238 3147.2928 3160.0884 3165.0846 3186.4879 3202.3529
redmass: 4.8983 4.1771 4.8684 3.8024 4.4033 4.8816 4.2804 4.4392 4.3861 3.3014 4.5530 3.0652 2.4324 2.8853 4.5253 1.5357 1.2935 1.4665 2.9300 1.9465 1.5207 2.2857 4.6360 3.0089 1.0937 3.3715 2.6475 4.0007 3.1299 3.5673 3.1746 2.8604 3.6273 3.9284 3.5188 3.6142 4.3574 3.5594 3.8762 3.6135 4.7521 5.3622 6.7146 5.6929 5.9470 12.1032 4.7172 5.9684 3.7192 2.7054 2.2640 2.6159 1.5839 2.7138 3.0271 3.1002 1.2507 1.7409 1.4166 1.7247 1.6542 1.2023 3.3260 1.3777 1.3582 1.3692 1.3098 3.7873 1.4864 2.4585 1.7153 2.9549 2.0817 2.3411 2.1843 2.4116 1.8421 1.4587 1.4245 2.8103 2.4192 1.2518 2.0751 2.0760 2.9940 1.4193 2.6149 2.6222 3.0787 1.1304 1.7594 1.2970 3.9473 1.2696 5.3348 1.1834 10.4028 1.2625 1.2330 1.2698 2.7832 1.6650 1.4776 1.0918 1.0507 1.0524 1.0747 1.0510 1.0703 1.0847 2.3360 1.0649 1.0503 1.2668 1.1656 1.5520 9.5886 7.3425 7.1274 6.9883 6.2280 9.5438 1.0347 1.0348 1.0358 1.0357 1.0362 1.0607 1.1000 1.0999 1.1006 1.1008 1.0985 1.0993 1.0991 1.0973 1.1024 1.0955 1.0905 1.1064 1.0868 1.0878 1.0960 1.0943 1.0958 1.0961 1.0946
irintensity: 0.0374 0.5756 0.0942 0.3442 1.4951 2.8857 0.4496 0.7498 2.4137 0.7170 0.1070 1.6421 2.8849 1.3073 0.5166 1.1087 0.8942 3.3931 4.1540 0.3652 0.0548 2.2534 5.2188 1.2633 0.2920 20.7509 2.7126 3.4125 0.5324 0.2757 5.1017 0.2821 5.1774 1.5753 0.1268 4.4185 2.7408 11.9057 4.7706 8.6060 7.0189 2.3242 1.4746 3.6328 2.0434 17.1923 23.4426 2.5992 7.0845 32.3213 22.8264 38.4743 11.0875 0.8745 19.4704 11.5234 1.8127 44.1875 3.2866 3.8444 2.5872 0.2298 6.0254 3.2625 0.5562 2.9008 1.4250 59.8252 18.2964 100.1143 43.4475 6.7767 100.1889 112.8240 61.7364 49.1358 8.6150 1.4359 11.9490 642.4321 277.1814 65.3558 31.0503 199.3385 6.1464 18.3995 1.7729 50.1020 40.4016 8.9815 1.1971 1.8358 325.4953 4.7133 18.4874 18.0353 7.5088 20.1359 27.1703 7.5488 13.5123 33.4627 28.5322 25.5640 0.1882 11.6299 37.4007 2.5676 0.4861 15.5186 95.4655 19.6528 11.8991 1.0196 88.9756 10.2951 131.4332 49.5923 2.4925 28.5096 34.9375 219.4505 31.5148 31.4239 34.8186 43.3897 17.1773 27.7751 5.9910 6.1947 14.1424 22.3833 127.5934 39.3357 44.0757 33.9767 1.4769 17.8593 7.5713 28.5642 4.2091 3.3626 14.7920 27.8010 10.9645 2.8276 5.7980
temp: 298.150 k
press: 1.00000 atm
elementType: 8 8 8 8 7 6 6 6 6 6 6 6 6 6 6 6 6 6 6 6 6 6 6 6 6 6 1 1 1 1 1 1 1 1 1 1 1 1 1 1 1 1 1 1 1 1 1 1 1 1 1
symmnumber: 1
zpe: 1088326.4 jmol-1
zpe.correction: 0.414522 hartree
zpe.thermalcorrener: 0.441048 hartree
zpe.thermalcorrenthalpy: 0.441992 hartree
zpe.thermalcorrgfe: 0.355369 hartree
zpe.sumelectzpe: -1168.961804 hartree
zpe.sumelectthermal: -1168.935277 hartree
zpe.sumelectthermalent: -1168.934333 hartree
zpe.sumelectthermalfe: -1169.020957 hartree
dipole: -0.6909 3.9387 2.8895
dipole: 4.9335
quadrupole: -137.3712 -137.1212 -158.1459
quadrupole: 1.0732 1.0959 -7.2537
quadrupole: 6.8416 7.0915 -13.9331 1.0732 1.0959 -7.2537
hfenergy: -1169.3763255 hartree
pointgroup: C01 [X(C21H25N1O4)]
dipole: -0.1296466 1.7313733 0.8677625 debye
polarizability: 333.7177314|-29.0451061|284.9386285|-10.5123424|-17.7422104|153.7724129 unknown
InChI: InChI=1S/C21H25NO4/c1-6-25-20(24)26-18-10-8-7-9-17(18)22(5)19(23)15-11-13-16(14-12-15)21(2,3)4/h7-14H,6H2,1-5H3
charge 0 multiplicity 1
51 atoms
O  -0.330796 -2.836762 -0.518578
O  2.678162 0.430873 -0.265994
O  2.715182 2.551803 -0.857922
O  4.703642 1.33175 -1.117849
N  0.740471 -1.186477 0.754927
C  -5.560812 1.145973 0.054074
C  -4.21616 0.38272 0.102708
C  -6.778432 0.21389 0.281234
C  -5.571721 2.241093 1.163596
C  -5.718259 1.824367 -1.340932
C  -4.133285 -1.017992 0.318437
C  -2.994535 1.087346 -0.086961
C  -1.680814 -0.966298 0.189371
C  -2.889934 -1.684307 0.346834
C  -1.748585 0.432972 -0.040201
C  -0.388765 -1.739657 0.120655
C  2.04365 -1.743494 0.487328
C  0.669745 -0.155125 1.81988
C  3.085771 -0.919783 -0.023888
C  2.319551 -3.109115 0.722246
C  4.379371 -1.42926 -0.268224
C  3.603217 -3.638166 0.469457
C  4.627947 -2.797278 -0.01682
C  3.503523 1.420361 -0.781687
C  3.409426 3.778086 -1.372077
C  4.190991 4.473378 -0.256003
H  -6.736216 -0.282284 1.26855
H  -7.710264 0.807408 0.24472
H  -6.849219 -0.566702 -0.49864
H  -4.745411 2.963161 1.035436
H  -6.522927 2.805241 1.132309
H  -5.471607 1.78637 2.166225
H  -6.672714 2.381904 -1.387701
H  -4.8993 2.53706 -1.544949
H  -5.717851 1.068669 -2.147478
H  -5.04566 -1.605185 0.455984
H  -3.012346 2.165764 -0.282359
H  -2.843287 -2.771109 0.474347
H  -0.828084 1.002254 -0.212228
H  1.059439 0.815895 1.470373
H  -0.372568 -0.032703 2.148152
H  1.271788 -0.491456 2.683873
H  1.511852 -3.747471 1.087381
H  5.162228 -0.77728 -0.657349
H  3.799358 -4.69962 0.65217
H  5.62779 -3.199967 -0.210811
H  2.576513 4.394281 -1.744719
H  4.069091 3.482561 -2.206633
H  5.026919 3.843806 0.091908
H  3.533881 4.707286 0.599138
H  4.611844 5.422417 -0.636707
