program: Gaussian 09
title: 000157551
version: EM64L-G09RevD.01
frameworkgroup: C1[X(C14H7ClF6N4O5)]
method: RPBEPBE
basis: SDD
operation: Freq
keyword: #p
keyword: freq=noraman
keyword: PBEPBE/SDD
title: #p freq=noraman PBEPBE/SDD
converged: YES YES NO NO
title: Mulliken charges:
elementType: Cl F F F F F F O O O O O N N N N C C C C C C C C C C C C C C H H H H H H H
charge: 0.007850 -0.156650 -0.139007 -0.165370 -0.159343 -0.157815 -0.152732 -0.259117 -0.178763 -0.167968 -0.169480 -0.234964 -0.424990 0.035612 0.022378 -0.037962 0.311248 0.239543 0.254232 0.106205 0.235661 -0.593967 0.292861 0.281848 -0.289284 0.330337 -0.217470 -0.414477 0.262843 -0.499532 0.326562 0.369019 0.299934 0.287192 0.245500 0.257852 0.252215
chargesum: 0.00000
title: Mulliken charges with hydrogens summed into heavy atoms:
elementType: Cl F F F F F F O O O O O N N N N C C C C C C C C C C C C C C
charge: 0.007850 -0.156650 -0.139007 -0.165370 -0.159343 -0.157815 -0.152732 -0.259117 -0.178763 -0.167968 -0.169480 -0.234964 -0.055971 0.035612 0.022378 -0.037962 0.311248 0.239543 0.254232 0.106205 0.235661 -0.267406 0.292861 0.281848 -0.289284 0.330337 0.082464 -0.127284 0.262843 0.256035
polarizability: 3.54039199e+02 5.27366229e+00 2.75308381e+02 -1.79622693e+01 1.44360927e+00 1.24323404e+02
1716.lowfreq: -9.1466 -6.0401 -0.0009 0.0013 0.0017 1.0783 2.4056 20.4871 23.7194
frequency: -8.6088 20.4660 23.6980 32.3849 43.8873 52.2186 56.7412 76.3873 82.2903 99.3059 108.0590 118.8621 128.6639 136.4612 147.5958 155.2900 161.1107 187.2990 202.9108 224.0506 236.3764 250.9252 261.5001 281.7299 289.1620 299.4213 306.5931 324.4838 356.6272 365.0644 385.6649 391.3522 409.5106 425.9120 433.0378 450.9195 455.0714 485.5632 493.7453 514.1389 536.5306 551.7066 591.5973 610.2957 616.4190 623.5760 644.9264 658.1338 662.6649 680.1765 704.1896 714.8231 718.5386 748.6308 769.3645 785.2669 811.1623 822.7005 872.9302 895.5885 910.4558 916.1448 930.4187 951.2716 994.5682 997.4140 1002.4456 1023.4822 1027.8201 1036.4871 1053.2038 1097.3055 1102.3793 1145.3664 1166.1582 1193.8718 1209.2992 1214.3170 1243.1689 1284.4382 1290.5353 1320.5448 1336.7112 1345.6021 1359.4199 1370.2295 1382.1139 1405.3020 1440.4263 1459.6324 1465.2381 1467.9293 1478.9253 1501.1688 1536.7545 1582.0075 1593.4781 1617.3162 3017.4878 3136.1278 3158.9045 3160.3339 3167.2421 3184.9947 3186.4437
redmass: 17.7024 13.1791 12.9084 11.1079 9.9382 7.3780 10.7133 1.6420 3.3260 9.1549 12.8444 9.3811 17.5444 13.1287 8.1723 4.1338 5.9370 11.5238 8.2695 4.5315 11.5848 11.8660 12.1299 9.1503 10.0482 11.7302 11.8239 12.7520 11.1310 9.5340 11.1678 11.0620 10.0113 10.7593 8.3621 5.7783 6.8371 7.1183 10.4211 12.4867 10.2638 9.1178 10.4264 7.5058 6.7555 8.8845 10.9590 9.4793 9.0933 10.2901 7.7584 11.1795 10.4320 5.5178 7.9643 9.7006 9.8472 1.6709 9.3638 6.8944 1.8143 2.8573 1.4214 1.5065 10.7058 7.0821 9.5400 11.8632 11.5202 6.7884 3.1531 3.0461 1.4782 1.3200 7.3945 4.7685 2.9265 2.0478 8.0607 4.6071 2.7239 2.8973 4.8768 6.6860 4.1243 6.8263 4.0748 4.6279 1.5313 1.1030 3.2623 1.0730 5.7669 3.9493 9.4057 3.4785 3.6045 6.0726 1.0279 1.1063 1.0935 1.1056 1.0792 1.0938 1.0919
irintensity: 0.0999 0.2044 0.9384 0.2332 0.3068 2.2957 1.0056 0.2737 0.7633 1.8316 0.3308 1.8583 0.7146 1.8167 1.8963 7.5264 2.4331 1.7224 1.6675 7.7677 1.5948 0.8639 7.0062 5.3687 0.6717 2.0555 19.5748 3.4191 3.9008 0.0858 2.7049 2.3797 3.9754 15.2249 8.2336 1.9753 7.1621 1.0015 6.8602 4.9717 0.4869 19.3384 29.6155 17.9818 7.1359 14.2393 1.2704 15.4782 9.6760 1.5867 7.6640 15.8767 8.2501 14.3553 41.2431 5.6014 28.4923 76.4545 41.9949 57.2886 42.6559 57.8893 1.8384 85.6719 201.5374 130.8729 161.8515 101.6001 111.6403 28.0877 186.1478 171.6370 15.1105 39.4983 439.7151 104.6418 100.8496 221.1677 196.7870 47.5750 494.5036 29.4224 36.6315 386.3602 19.9879 19.7029 17.9694 182.1070 21.5210 15.9999 87.2663 7.2790 296.1337 34.7163 52.8538 788.9857 39.9245 143.8435 47.3375 7.1880 5.6377 8.7190 161.6265 3.9578 23.0667
temp: 298.150 k
press: 1.00000 atm
elementType: 17 9 9 9 9 9 9 8 8 8 8 8 7 7 7 7 6 6 6 6 6 6 6 6 6 6 6 6 6 6 1 1 1 1 1 1 1
symmnumber: 1
zpe: 556015.8 jmol-1
zpe.correction: 0.211775 hartree
zpe.thermalcorrener: 0.238448 hartree
zpe.thermalcorrenthalpy: 0.239392 hartree
zpe.thermalcorrgfe: 0.152525 hartree
zpe.sumelectzpe: -2189.573418 hartree
zpe.sumelectthermal: -2189.546745 hartree
zpe.sumelectthermalent: -2189.545801 hartree
zpe.sumelectthermalfe: -2189.632669 hartree
dipole: -0.5038 -0.5213 -1.5682
dipole: 1.7277
quadrupole: -198.3078 -183.5239 -182.4520
quadrupole: -13.6952 -1.4122 8.9937
quadrupole: -10.2132 4.5706 5.6426 -13.6952 -1.4122 8.9937
hfenergy: -2189.7851935 hartree
pointgroup: C01 [X(C14H7Cl1F6N4O5)]
dipole: 0.219738 -0.0972718 -0.6358376 debye
polarizability: 348.9217113|26.9224278|242.9276371|23.1040075|-62.5946539|161.8216359 unknown
InChI: InChI=1S/C14H7ClF6N4O5/c1-30-11-6(14(19,20)21)3-8(24(26)27)9(10(11)25(28)29)23-12-7(15)2-5(4-22-12)13(16,17)18/h2-4,23H,1H3
charge 0 multiplicity 1
37 atoms
Cl 3.05277 -1.907124 2.54065
F  -5.657145 -1.345527 -0.535932
F  -5.625682 0.758058 0.292201
F  -5.064084 0.382578 -1.873565
F  6.499618 0.90953 -0.391473
F  5.429783 1.211021 -2.376393
F  5.300798 2.800284 -0.77271
O  -3.069842 2.011338 -0.469532
O  0.197231 1.763607 1.66705
O  -0.38044 2.693588 -0.326938
O  -2.278123 -4.112474 0.909322
O  -0.263076 -3.404969 1.688781
N  0.562234 -1.047067 0.971174
N  -0.409845 1.738835 0.528316
N  -1.414249 -3.180988 1.103324
N  1.679456 0.431674 -0.517932
C  -0.75129 -0.758879 0.632345
C  -1.235238 0.539992 0.248508
C  -3.493811 -0.340432 -0.158608
C  -2.573206 0.755348 -0.190593
C  -1.736363 -1.812568 0.671395
C  -3.073543 -1.593468 0.289371
C  1.737037 -0.422632 0.541124
C  -4.93233 -0.13187 -0.554288
C  2.984243 -0.747912 1.149788
C  4.084275 0.728207 -0.420612
C  4.165024 -0.16884 0.669791
C  2.814569 1.001156 -0.983317
C  5.308566 1.395301 -0.974055
C  -2.878296 2.613531 -1.826838
H  -3.767476 -2.436314 0.334401
H  0.655613 -1.944648 1.494743
H  5.127002 -0.40464 1.131808
H  2.700338 1.688074 -1.827641
H  -3.529535 2.084166 -2.541044
H  -1.817558 2.569476 -2.113799
H  -3.199322 3.656787 -1.70472
