program: Gaussian 09
title: 000157542
version: EM64L-G09RevD.01
frameworkgroup: C1[X(C13H6Cl3F3N4O4)]
method: RPBEPBE
basis: SDD
operation: Freq
keyword: #p
keyword: freq=noraman
keyword: PBEPBE/SDD
title: #p freq=noraman PBEPBE/SDD
converged: YES YES NO NO
title: Mulliken charges:
elementType: Cl Cl Cl F F F O O O O N N N N C C C C C C C C C C C C C H H H H H H
charge: 0.114283 -0.004776 -0.023473 -0.155295 -0.147617 -0.145375 -0.175169 -0.140517 -0.172842 -0.236589 -0.427837 -0.000667 0.021324 -0.035144 0.288584 0.556467 0.239580 0.455732 -0.564458 -0.597387 0.268502 0.268850 -0.438003 0.669824 -0.262466 -0.765108 -0.342349 0.329261 0.369969 0.262583 0.258029 0.248346 0.283737
chargesum: 0.00000
title: Mulliken charges with hydrogens summed into heavy atoms:
elementType: Cl Cl Cl F F F O O O O N N N N C C C C C C C C C C C C C
charge: 0.114283 -0.004776 -0.023473 -0.155295 -0.147617 -0.145375 -0.175169 -0.140517 -0.172842 -0.236589 -0.057868 -0.000667 0.021324 -0.035144 0.288584 0.556467 0.239580 0.455732 -0.564458 -0.268127 0.268502 0.268850 -0.438003 0.669824 -0.262466 0.003850 -0.058613
polarizability: 3.80406624e+02 2.04541318e+01 2.71898232e+02 -8.25590021e+00 8.02345877e+00 1.25077458e+02
1716.lowfreq: -4.4377 -0.0019 -0.0017 0.0022 4.6001 5.1087 21.3106 25.3945 34.2474
frequency: 21.2908 25.3694 34.2459 44.9405 58.0733 62.3872 72.2720 88.0685 102.2789 104.6686 117.5520 133.2263 140.4884 147.3571 187.0011 201.3765 217.5956 226.0025 239.3335 251.0380 268.4180 278.4362 287.5131 293.1965 315.6044 343.4185 352.2149 371.4378 381.7584 393.1162 417.1954 443.1352 473.6584 487.7089 519.6804 525.2126 549.8453 562.9186 575.3302 589.2671 610.3175 621.1808 647.7010 671.4403 691.3558 707.1820 711.8165 737.0396 744.6275 756.7546 784.8084 807.6856 827.3004 889.8717 905.1894 910.9536 951.6836 978.1214 1006.7756 1028.4908 1031.8447 1041.1940 1050.6704 1073.3617 1141.8893 1165.5020 1201.5662 1226.7222 1228.1468 1278.1880 1311.2551 1325.2844 1335.9590 1343.8749 1378.7063 1392.5524 1401.5908 1408.5487 1423.3557 1455.8244 1466.5501 1480.9903 1499.2447 1529.3989 1552.5505 1588.4467 1614.5006 2998.8311 3076.7310 3130.4476 3168.4027 3169.8618 3187.3960
redmass: 12.0607 14.0762 12.1099 18.2733 16.3819 16.5177 1.0830 12.0214 4.2318 15.0667 12.4157 13.2431 14.3324 12.1757 15.3720 12.1906 15.1610 18.8716 5.9392 9.3115 7.1081 5.8152 13.4498 6.8541 17.0885 13.9909 8.7714 10.6465 10.9217 9.5229 7.5729 9.5400 10.7174 9.5723 9.3912 4.7886 6.6719 8.9684 10.2546 4.8872 10.9732 8.7488 7.2717 9.8242 10.5980 9.1222 13.2193 8.0416 6.0315 8.5044 4.4491 5.1270 2.0048 7.7244 3.3229 1.8247 1.4723 3.0121 8.1736 11.4753 2.2828 1.5186 5.9242 11.0887 3.2820 5.1692 7.7658 2.6972 4.2775 4.0972 2.9576 6.8594 7.7439 5.6293 6.5354 6.9747 1.3592 6.6623 2.3373 1.2801 1.0444 5.9835 4.1292 5.2340 8.4414 2.2638 7.4923 1.0386 1.0971 1.0984 1.0797 1.0928 1.0916
irintensity: 0.2858 0.2085 0.2437 0.0258 0.1554 1.9244 0.2995 0.0448 1.5920 1.7724 1.2284 0.4667 0.5105 1.5678 3.1948 1.5120 0.2469 1.3704 1.0598 2.7243 2.2519 3.8473 0.4224 2.7182 1.2548 13.0348 12.1469 2.2023 0.4705 4.2563 3.1374 13.6089 16.5078 0.8017 0.3308 4.8616 1.3600 1.3391 11.1290 12.8406 34.3013 25.2591 7.9218 2.8760 19.8605 5.5713 8.0138 14.3118 6.9659 17.6026 16.2103 29.0522 61.9670 23.2549 3.7242 18.7064 74.8586 69.3218 181.4347 111.2231 23.8984 6.1410 75.9865 179.1765 103.2256 362.5303 161.3868 42.9707 102.3627 185.6344 34.3079 94.2202 107.9496 114.4228 26.0601 62.5481 91.8882 66.1253 169.7035 75.0286 18.8862 185.9723 50.2513 20.4696 33.5701 508.0800 230.3386 3.3816 5.4226 6.9605 127.0001 5.6947 26.9967
temp: 298.150 k
press: 1.00000 atm
elementType: 17 17 17 9 9 9 8 8 8 8 7 7 7 7 6 6 6 6 6 6 6 6 6 6 6 6 6 1 1 1 1 1 1
symmnumber: 1
zpe: 487916.8 jmol-1
zpe.correction: 0.185838 hartree
zpe.thermalcorrener: 0.210776 hartree
zpe.thermalcorrenthalpy: 0.211721 hartree
zpe.thermalcorrgfe: 0.128348 hartree
zpe.sumelectzpe: -2696.482430 hartree
zpe.sumelectthermal: -2696.457491 hartree
zpe.sumelectthermalent: -2696.456547 hartree
zpe.sumelectthermalfe: -2696.539919 hartree
dipole: -4.2806 0.5394 -0.2745
dipole: 4.3232
quadrupole: -169.1609 -191.2320 -176.4915
quadrupole: -3.8826 3.0111 4.6458
quadrupole: 9.8005 -12.2705 2.4700 -3.8826 3.0111 4.6458
hfenergy: -2696.6682675 hartree
pointgroup: C01 [X(C13H6Cl3F3N4O4)]
dipole: 1.697281 -0.1082185 0.0227094 debye
polarizability: 376.2305673|33.250848|222.3782138|-0.0677345|-71.4538331|178.7735329 unknown
InChI: InChI=1S/C13H6Cl3F3N4O4/c1-4-6(14)3-20-12(8(4)15)21-10-7(22(24)25)2-5(13(17,18)19)9(16)11(10)23(26)27/h2-3,21H,1H3
charge 0 multiplicity 1
33 atoms
Cl -2.961903 2.410355 -0.95653
Cl 3.575894 -1.00397 2.282726
Cl 5.697568 1.61427 -2.215974
F  -5.273466 -1.410133 -0.223087
F  -5.323414 0.792523 0.286219
F  -4.890058 0.125737 -1.839281
O  0.633502 2.217402 0.90352
O  -0.069102 2.668401 -1.218668
O  -1.726358 -3.792728 1.328227
O  0.325113 -2.936345 1.809691
N  1.007752 -0.69872 0.677909
N  -0.051815 1.952538 -0.158932
N  -0.87993 -2.825123 1.30422
N  1.958096 0.467298 -1.158981
C  -0.331724 -0.491241 0.423464
C  -0.900423 0.730133 -0.095903
C  -1.280223 -1.544743 0.705157
C  -3.159605 -0.245215 -0.164744
C  -2.274659 0.84985 -0.386414
C  -2.646234 -1.416597 0.400039
C  2.126744 -0.110291 0.058334
C  -4.634256 -0.176721 -0.482208
C  3.411746 -0.209793 0.653105
C  4.566478 0.299133 0.010219
C  4.330287 0.905643 -1.254122
C  5.929867 0.200096 0.648296
C  3.033354 0.98111 -1.802096
H  -3.300621 -2.266676 0.607019
H  1.17528 -1.513875 1.306818
H  5.943434 0.737631 1.613645
H  6.182197 -0.853271 0.865203
H  6.70781 0.625035 -0.002053
H  2.852269 1.458686 -2.768917
