program: Gaussian 09
title: 000157521
version: EM64L-G09RevD.01
frameworkgroup: C1[X(C10H22N2O2)]
method: RPBEPBE
basis: SDD
operation: Freq
keyword: #p
keyword: freq=noraman
keyword: PBEPBE/SDD
title: #p freq=noraman PBEPBE/SDD
converged: NO YES NO NO
title: Mulliken charges:
elementType: O O N N C C C C C C C C C C H H H H H H H H H H H H H H H H H H H H H H
charge: -0.462852 -0.290885 -0.067371 0.045809 -0.337722 -0.423118 -0.373136 -0.387339 -0.358755 -0.338317 -0.033098 -0.357320 -0.715962 -0.693146 0.179777 0.259763 0.260634 0.215720 0.186983 0.217747 0.205895 0.237409 0.223309 0.210060 0.184129 0.191058 0.182075 0.197522 0.202996 0.234332 0.216120 0.208333 0.218409 0.211971 0.208600 0.340367
chargesum: 0.00000
title: Mulliken charges with hydrogens summed into heavy atoms:
elementType: O O N N C C C C C C C C C C
charge: -0.122484 -0.290885 -0.067371 0.045809 0.101817 0.053236 0.031594 0.055965 0.074615 0.036871 0.148977 0.043199 -0.057176 -0.054166
polarizability: 1.48542932e+02 3.11870410e+00 1.39666850e+02 -1.83483165e-01 8.58387686e+00 1.13399533e+02
1716.lowfreq: -22.6423 -12.1694 -0.0008 -0.0007 -0.0005 1.5700 9.3003 15.2040 26.6457
frequency: -19.5227 14.4651 26.3878 42.7784 59.0794 76.4914 91.4352 104.3578 119.4721 133.1162 157.9557 217.2523 223.0524 232.8342 254.7284 273.8882 280.0904 328.9423 352.0338 367.2702 378.1509 438.5088 453.7239 475.5212 511.5558 685.8731 725.1649 748.4364 750.7580 798.1667 821.6061 829.3129 857.3973 894.1122 923.3157 946.2090 980.8822 1005.3289 1007.4253 1030.1969 1045.3788 1059.7093 1071.1786 1073.3732 1100.0263 1105.8514 1115.3352 1146.4289 1186.5344 1218.9739 1228.6483 1241.2374 1247.6713 1267.3572 1276.3847 1284.7318 1289.6938 1298.3467 1310.7819 1317.0229 1325.8405 1339.2764 1351.2747 1354.5768 1361.8709 1366.6979 1385.1104 1386.4371 1388.4620 1447.9090 1453.7809 1460.2207 1464.8726 1468.2630 1470.2593 1471.8607 1476.1200 1479.7440 1480.2284 1487.1350 2921.7531 2952.1311 2970.2404 2972.0088 2972.3267 2972.7387 2974.8401 2979.2156 2987.1179 2994.3129 3002.8594 3023.6951 3035.1533 3043.3173 3044.0573 3063.8671 3068.2743 3072.4621 3073.6654 3078.5963 3085.8609 3563.5350
redmass: 1.6424 4.1398 3.2721 4.5169 4.3737 3.2474 2.4279 2.7830 1.9230 2.1234 3.5801 3.2670 1.1160 1.0977 3.7389 1.8441 1.7591 3.3457 3.0154 2.7991 4.2707 3.2551 2.6471 2.8849 3.5339 3.9473 1.0678 1.1467 1.2516 2.7712 2.5296 1.2770 1.8532 1.8884 1.7938 1.4046 1.6722 3.2256 3.0767 2.3478 3.0603 2.4705 1.7946 2.2711 1.9892 2.2347 2.4660 1.5791 1.9350 1.7598 1.8798 1.2272 1.2671 1.4510 1.2739 1.0525 1.1218 1.2534 1.3200 1.2946 1.5698 1.4194 1.5735 1.7878 1.6667 1.5412 1.4714 1.3743 1.2163 1.0880 1.0704 1.0857 1.0672 1.0554 1.0730 1.0633 1.0434 1.0911 1.0743 1.0904 1.0839 1.0588 1.0585 1.0607 1.0443 1.0376 1.0551 1.0634 1.0603 1.0976 1.0584 1.1023 1.0971 1.1016 1.0978 1.0982 1.1019 1.1046 1.0992 1.1005 1.0998 1.0662
irintensity: 0.3068 0.2491 2.0356 1.5197 1.0834 2.2937 1.5727 0.0684 0.1781 3.8783 0.9605 0.6663 0.0106 1.2073 9.6320 57.2076 82.9351 2.4979 11.7331 2.0865 4.6945 4.6364 8.8900 2.0601 4.1299 3.3940 11.9736 0.6239 7.5896 17.4334 4.0892 10.8369 20.0242 9.1113 7.9273 19.5160 29.8339 12.3753 80.2807 32.3955 10.3527 11.5127 28.4976 9.6496 19.0257 11.3110 10.6086 1.8963 6.5256 3.9207 29.2278 19.5700 11.0112 5.2374 25.0360 3.9545 2.8058 19.6838 18.7377 16.5459 51.5281 8.9873 0.6910 17.1442 17.3674 24.2719 30.3729 3.2719 11.4919 1.4169 3.7929 7.4637 0.0745 9.9298 2.6542 7.8054 12.9203 14.2559 6.5158 23.8607 57.9587 16.6785 44.6474 25.0575 23.8857 31.2914 16.0295 72.6102 15.0300 4.4309 56.6559 14.1758 21.2519 5.5026 16.8262 38.2556 25.6065 102.4316 51.0055 19.6990 47.9904 4.0149
temp: 298.150 k
press: 1.00000 atm
elementType: 8 8 7 7 6 6 6 6 6 6 6 6 6 6 1 1 1 1 1 1 1 1 1 1 1 1 1 1 1 1 1 1 1 1 1 1
symmnumber: 1
zpe: 824071.0 jmol-1
zpe.correction: 0.313872 hartree
zpe.thermalcorrener: 0.331283 hartree
zpe.thermalcorrenthalpy: 0.332228 hartree
zpe.thermalcorrgfe: 0.265804 hartree
zpe.sumelectzpe: -652.974192 hartree
zpe.sumelectthermal: -652.956780 hartree
zpe.sumelectthermalent: -652.955836 hartree
zpe.sumelectthermalfe: -653.022260 hartree
dipole: 0.8245 -5.5557 -3.4621
dipole: 6.5978
quadrupole: -77.0687 -100.4787 -88.6003
quadrupole: -6.3241 -2.0956 -8.8841
quadrupole: 11.6472 -11.7628 0.1156 -6.3241 -2.0956 -8.8841
hfenergy: -653.2880638 hartree
pointgroup: C01 [X(C10H22N2O2)]
dipole: -0.3947567 2.4037603 -0.8967749 debye
polarizability: 148.4094216|3.1383244|142.1198443|0.3649107|-2.8304762|111.0800489 unknown
InChI: InChI=1S/C10H22N2O2/c1-3-4-5-8-12(11-14)9-6-7-10(2)13/h10,13H,3-9H2,1-2H3
charge 0 multiplicity 1
36 atoms
O  -3.245544 1.206917 1.659197
O  -0.220379 -3.647994 0.194139
N  0.408702 -1.697485 -0.76465
N  0.762845 -2.893476 -0.159549
C  -1.45831 -0.054994 -0.248452
C  -0.99355 -1.306242 -1.028023
C  -2.947802 0.244332 -0.523181
C  1.559713 -0.849106 -1.138962
C  2.140202 -0.028382 0.037418
C  3.345714 0.832129 -0.400919
C  -3.453372 1.491553 0.220647
C  3.968273 1.633305 0.765937
C  -4.931807 1.801962 -0.073057
C  5.171147 2.495486 0.32645
H  -0.848768 0.824902 -0.540014
H  -1.317409 -0.208091 0.835564
H  -1.605137 -2.182617 -0.742537
H  -1.110929 -1.139258 -2.118117
H  -3.11379 0.39335 -1.609708
H  -3.565569 -0.620173 -0.209592
H  1.228921 -0.175249 -1.951145
H  2.347341 -1.509253 -1.546161
H  2.447674 -0.734098 0.833201
H  1.352897 0.619295 0.46944
H  3.032158 1.537104 -1.199828
H  4.123414 0.17882 -0.849187
H  -2.827342 2.366126 -0.071989
H  3.19117 2.282223 1.218726
H  4.285838 0.928694 1.560711
H  -5.569272 0.954061 0.236049
H  -5.091514 1.984652 -1.151976
H  -5.269893 2.704982 0.471148
H  5.598011 3.057004 1.177522
H  5.975046 1.866552 -0.100356
H  4.872814 3.228615 -0.446809
H  -3.629392 1.946655 2.19456
