program: Gaussian 09
title: 000157508
version: EM64L-G09RevD.01
frameworkgroup: C1[X(C18H16O4)]
method: RPBEPBE
basis: SDD
operation: Freq
keyword: #pfreq=noraman
keyword: PBEPBE/SDD
title: #p freq=noraman PBEPBE/SDD
converged: YES YES NO NO
title: Mulliken charges:
elementType: O O O O C C C C C C C C C C C C C C C C C C H H H H H H H H H H H H H H H H
charge: -0.433509 -0.455175 -0.481952 -0.446558 -0.217877 -0.365201 -0.207393 0.180792 -0.170103 0.223958 0.214571 0.278054 -0.390263 -0.426315 0.160809 -0.408054 0.440332 -0.516592 -0.348754 -0.441585 -0.259091 -0.251209 0.224504 0.229634 0.269566 0.270088 0.272071 0.226379 0.240073 0.346087 0.352357 0.373564 0.359898 0.232730 0.223700 0.241823 0.228548 0.230092
chargesum: 0.00000
title: Mulliken charges with hydrogens summed into heavy atoms:
elementType: O O O O C C C C C C C C C C C C C C C C C C
charge: -0.087422 -0.102818 -0.108388 -0.086660 0.006627 -0.135567 0.062173 0.180792 0.099985 0.223958 0.214571 0.278054 -0.118192 -0.199936 0.160809 -0.167981 0.440332 -0.283862 -0.125055 -0.199762 -0.030544 -0.021116
polarizability: 3.34959655e+02 -4.96390420e+00 2.14218138e+02 -2.57287968e+00 3.92384427e+00 1.10933522e+02
1716.lowfreq: -9.4578 -2.3635 -0.0009 -0.0006 -0.0003 11.0517 43.7930 54.2724 81.3144
frequency: 43.6971 54.2504 81.3132 111.7185 136.7213 140.9421 173.5419 201.6280 219.4455 226.5456 240.1252 266.1618 279.7886 283.0655 310.9048 330.7241 354.3721 385.5992 409.9017 433.0282 451.8297 480.0583 490.4544 492.1435 525.5828 534.1557 538.8797 546.1711 567.2871 583.0421 604.5716 645.1585 668.8624 694.6468 726.7388 747.5779 759.1861 764.1334 800.6294 815.6088 825.2735 845.3247 853.1781 862.5547 876.6658 888.7616 909.2807 930.5975 954.8415 969.6310 974.6841 982.0714 992.6552 1006.4492 1014.0341 1036.7720 1046.4043 1069.6357 1091.3990 1131.0564 1157.3128 1171.6622 1177.9264 1180.6136 1205.9617 1207.7662 1226.8516 1237.9210 1241.5757 1248.6844 1268.8904 1289.7610 1292.7049 1301.6737 1324.0988 1350.2243 1351.8932 1368.4762 1385.1455 1390.6461 1400.0412 1405.2145 1419.9019 1426.8996 1448.1579 1463.8042 1500.5143 1532.1599 1580.2977 1602.2679 1619.2147 1629.0627 2944.7740 2959.6322 3043.8209 3076.1879 3121.9301 3124.7641 3133.9451 3144.1056 3153.2371 3164.2148 3165.0888 3170.1822 3321.5567 3449.3697 3531.5709 3563.9572
redmass: 5.6450 4.8729 6.0391 3.9463 5.9370 6.1171 5.4927 6.3977 3.5403 3.4980 1.4247 5.1120 5.9851 4.9660 1.0787 5.0944 4.5836 6.2066 3.4735 4.6585 4.7449 4.3388 4.7994 4.4966 4.2065 2.2537 4.4844 2.1061 3.7084 3.2775 4.8034 3.2285 4.5468 1.5032 2.3712 3.1900 3.4324 1.5583 2.2250 3.4729 2.6146 2.8864 2.1763 3.3814 3.7961 2.0428 5.9395 3.2771 1.3907 3.4849 1.4571 1.4567 1.3521 4.3640 5.1212 2.5775 3.0877 2.7014 1.7155 1.6025 1.1976 1.2228 1.1517 1.2207 1.4141 1.2611 2.3340 1.5017 1.7400 1.6746 1.6215 1.4515 1.4101 1.7218 2.0493 1.5281 1.3964 1.4998 2.0680 2.2580 2.0104 4.9455 1.5451 2.1260 3.2178 2.8384 3.4955 4.0817 8.2300 6.4287 6.5389 6.6749 1.0839 1.0856 1.0838 1.0881 1.0869 1.0877 1.0885 1.0887 1.0927 1.0947 1.0987 1.0960 1.0673 1.0645 1.0659 1.0666
irintensity: 0.6402 1.7165 1.7842 1.2957 1.2997 0.8800 3.8971 2.2133 19.3746 27.4084 128.3978 9.2481 25.6096 6.2644 139.9686 1.5900 1.0004 5.9563 4.1782 10.0713 13.7407 1.9541 7.4370 6.4778 0.4134 15.6269 2.3012 26.1434 12.6658 9.1242 20.4933 21.4219 36.3795 130.7776 36.7766 0.2475 9.8760 75.8760 1.9057 66.5537 38.9108 14.5959 3.6341 12.5019 13.8461 6.4303 81.6560 13.1496 2.1714 36.7913 6.3514 3.8171 0.4666 53.7106 65.6870 15.7591 30.8678 21.3451 23.5739 22.1405 38.8757 16.2320 10.5200 4.5480 9.1459 35.9636 6.5866 9.8382 3.2173 12.2056 9.8810 12.6829 5.2965 3.4707 6.7251 11.1819 16.7457 37.8993 24.1694 22.6268 9.5827 1.9946 59.3250 17.9377 3.2065 7.5579 15.2976 0.8673 0.7800 1.8806 4.0927 3.2752 61.6314 55.4749 6.3533 46.0256 0.5902 8.9479 9.9749 4.4106 24.5557 28.2824 11.7997 29.4047 125.7316 36.2582 7.4585 5.3215
temp: 298.150 k
press: 1.00000 atm
elementType: 8 8 8 8 6 6 6 6 6 6 6 6 6 6 6 6 6 6 6 6 6 6 1 1 1 1 1 1 1 1 1 1 1 1 1 1 1 1
symmnumber: 1
zpe: 782699.4 jmol-1
zpe.correction: 0.298114 hartree
zpe.thermalcorrener: 0.315934 hartree
zpe.thermalcorrenthalpy: 0.316878 hartree
zpe.thermalcorrgfe: 0.253580 hartree
zpe.sumelectzpe: -994.856132 hartree
zpe.sumelectthermal: -994.838313 hartree
zpe.sumelectthermalent: -994.837368 hartree
zpe.sumelectthermalfe: -994.900666 hartree
dipole: 1.9912 -5.0475 1.4684
dipole: 5.6212
quadrupole: -126.3342 -110.5109 -133.4306
quadrupole: 18.0511 -4.3649 -1.8982
quadrupole: -2.9090 12.9143 -10.0054 18.0511 -4.3649 -1.8982
hfenergy: -995.1542464 hartree
pointgroup: C01 [X(C18H16O4)]
dipole: -0.7977406 1.9994324 0.5068551 debye
polarizability: 334.9031266|-4.2942271|213.8391276|5.37174|-7.1415821|111.3690609 unknown
InChI: InChI=1S/C18H16O4/c19-15-13-8-7-11-10-4-2-1-3-9(10)5-6-12(11)14(13)16(20)18(22)17(15)21/h1-8,15-22H
charge 0 multiplicity 1
38 atoms
O  3.586531 0.968994 2.088083
O  2.185076 1.973324 -1.281833
O  4.135768 0.029542 -1.476285
O  3.608198 -2.43764 -0.426886
C  3.548542 1.209284 0.638861
C  2.106961 1.50846 0.150169
C  4.089339 -0.077365 -0.00572
C  1.182453 0.305471 0.163728
C  3.212267 -1.283536 0.390516
C  1.714199 -0.995761 0.260738
C  -0.24353 0.503748 0.06393
C  -1.132627 -0.631484 0.104282
C  0.828034 -2.111353 0.265815
C  -0.554153 -1.934231 0.20377
C  -2.582695 -0.426831 0.034228
C  -0.812027 1.826289 -0.091341
C  -3.099419 0.913152 -0.096119
C  -2.177731 2.021471 -0.16473
C  -3.523729 -1.502081 0.090152
C  -4.510362 1.131445 -0.165245
C  -4.904041 -1.268421 0.021765
C  -5.406551 0.058718 -0.107462
H  4.201229 2.068739 0.367016
H  1.687671 2.334241 0.763526
H  5.127913 -0.258551 0.313586
H  3.439729 -1.569003 1.432036
H  1.263657 -3.114233 0.308872
H  -1.196319 -2.819461 0.222513
H  -0.145846 2.68769 -0.188075
H  3.264942 1.772117 2.570156
H  2.594245 2.877405 -1.316731
H  3.379657 0.618167 -1.775774
H  3.769693 -2.065204 -1.339293
H  -2.586563 3.031718 -0.287086
H  -3.17315 -2.533382 0.190922
H  -4.880624 2.158731 -0.265598
H  -5.601494 -2.112011 0.068307
H  -6.486544 0.233244 -0.160994
