program: Gaussian 09
title: 000157497
version: EM64L-G09RevD.01
frameworkgroup: C1[X(C8H19O2P)]
method: RPBEPBE
basis: SDD
operation: Freq
keyword: #p
keyword: freq=noraman
keyword: PBEPBE/SDD
title: #p freq=noraman PBEPBE/SDD
converged: YES YES NO NO
title: Mulliken charges:
elementType: P O O C C C C C C C C H H H H H H H H H H H H H H H H H H H
charge: 0.969565 -0.693102 -0.636252 -0.369506 -0.363613 -0.371843 -0.387416 -0.352823 -0.753295 -0.356161 -0.695767 0.200749 0.188388 0.188442 0.212129 0.192562 0.186882 0.251022 0.219080 0.186879 0.190742 0.259221 0.303947 0.196181 0.194028 0.019082 0.210903 0.215564 0.209278 0.385135
chargesum: 0.00000
title: Mulliken charges with hydrogens summed into heavy atoms:
elementType: P O O C C C C C C C C
charge: 0.988647 -0.307967 -0.636252 0.019632 0.036958 0.007601 0.082685 0.024798 -0.190126 0.034047 -0.060022
polarizability: 1.44858074e+02 -2.04319013e-01 1.04924444e+02 2.96339138e+00 -1.64862514e+00 9.98974978e+01
1716.lowfreq: -12.5241 -0.0022 -0.0019 -0.0016 5.7682 7.6930 25.8767 36.0041 37.2185
frequency: 25.5949 35.8099 36.6142 61.7944 86.2699 95.0417 123.5877 139.1554 166.7161 177.5746 203.5305 229.4013 240.8148 305.2729 311.5739 345.2135 376.7581 457.2631 496.1652 628.9772 675.1711 721.8867 731.2351 758.1349 785.6791 824.6163 867.0427 891.3137 901.9449 915.0630 973.0172 980.0914 995.1943 1020.9033 1029.2617 1042.3108 1067.3561 1081.2597 1085.3581 1114.3137 1116.4233 1181.5419 1193.2854 1228.6230 1239.3218 1263.9194 1281.1229 1283.5544 1289.0399 1298.8989 1305.2525 1323.6228 1350.7298 1357.6169 1366.6051 1389.6746 1426.6557 1457.6454 1461.8124 1464.2143 1468.3408 1475.5511 1476.7808 1482.7388 1488.4495 2152.2113 2950.8828 2952.4561 2954.5962 2962.2295 2968.4481 2971.7184 2985.2178 2986.8726 2993.7749 3004.8318 3013.4659 3022.6154 3037.5672 3051.4842 3067.9610 3070.8479 3089.6319 3596.5330
redmass: 6.3591 4.4128 1.7013 3.6023 2.9706 1.7832 2.7359 1.8897 3.6402 2.6437 2.8015 1.1204 1.8033 2.5031 2.6183 4.2783 3.4209 2.8889 3.0151 3.0464 8.4916 1.0636 1.1105 1.2322 1.3398 1.2111 1.4031 1.7816 1.1526 1.3821 1.9581 2.5885 1.2661 3.4653 1.9484 1.8310 2.9008 2.1429 2.2802 1.7637 2.1031 1.4863 1.4873 1.3771 1.3150 1.2979 1.2304 1.0591 1.2021 1.1142 1.1561 1.3217 1.4882 1.6559 1.5403 1.2180 1.0817 1.0703 1.0732 1.0674 1.0804 1.0770 1.0427 1.0828 1.0907 1.0400 1.0588 1.0587 1.0592 1.0596 1.0591 1.0365 1.0806 1.0772 1.0965 1.1012 1.0623 1.1027 1.1040 1.1024 1.1006 1.0993 1.1034 1.0663
irintensity: 2.6524 0.8209 0.4682 0.5911 0.5185 0.3717 0.4706 0.0104 11.5012 14.6241 26.1133 0.0019 70.6100 22.2915 38.4108 39.8096 12.5572 0.1644 2.3283 8.9349 161.4425 13.5685 0.6564 3.8867 33.3014 9.0267 69.9031 3.4095 7.9395 0.6359 7.1390 5.6237 12.2530 8.6865 59.4668 37.3594 3.0097 0.3224 19.5917 30.7670 4.9893 4.9407 1.2359 0.5451 5.6875 1.9193 0.6410 0.3775 1.1859 0.8950 0.5187 0.1507 0.4585 0.3529 1.6964 11.0510 10.6556 3.1859 0.0817 0.7329 2.2897 2.3194 12.4229 3.6565 24.8336 136.2714 0.8809 5.0489 0.6566 20.7029 138.4265 36.4450 11.8154 33.0869 5.3354 2.2245 7.8379 0.5382 76.1047 74.7287 96.2752 54.2115 10.4301 43.8590
temp: 298.150 k
press: 1.00000 atm
elementType: 15 8 8 6 6 6 6 6 6 6 6 1 1 1 1 1 1 1 1 1 1 1 1 1 1 1 1 1 1 1
symmnumber: 1
zpe: 678934.9 jmol-1
zpe.correction: 0.258593 hartree
zpe.thermalcorrener: 0.274011 hartree
zpe.thermalcorrenthalpy: 0.274955 hartree
zpe.thermalcorrgfe: 0.213553 hartree
zpe.sumelectzpe: -806.967130 hartree
zpe.sumelectthermal: -806.951712 hartree
zpe.sumelectthermalent: -806.950768 hartree
zpe.sumelectthermalfe: -807.012169 hartree
dipole: 0.6476 1.6763 -2.2294
dipole: 2.8635
quadrupole: -77.5031 -79.3015 -80.7237
quadrupole: 0.1985 5.3942 4.9672
quadrupole: 1.6730 -0.1254 -1.5476 0.1985 5.3942 4.9672
hfenergy: -807.2257227 hartree
pointgroup: C01 [X(C8H19O2P1)]
dipole: -0.2626737 0.4038355 1.0183875 debye
polarizability: 144.7022402|-1.5534059|103.7479769|3.683341|2.6248863|101.2297984 unknown
InChI: InChI=1S/C8H19O2P/c1-2-3-4-5-6-7-8-11(9)10/h9,11H,2-8H2,1H3
charge 0 multiplicity 1
30 atoms
P  3.56412 -0.750731 0.119261
O  5.247733 -0.490699 0.535821
O  3.279583 -1.330519 -1.348334
C  -0.969007 0.704215 -0.199401
C  0.401648 0.366935 0.42852
C  -2.12705 -0.144318 0.372169
C  1.549514 1.223654 -0.153287
C  -3.495093 0.178503 -0.269988
C  2.92472 0.965036 0.499112
C  -4.654613 -0.667486 0.304094
C  -6.016669 -0.344624 -0.34755
H  -0.911792 0.554246 -1.297243
H  -1.190719 1.780728 -0.041728
H  0.348468 0.512808 1.528095
H  0.612559 -0.709427 0.257224
H  -1.899215 -1.220684 0.224243
H  -2.191484 0.012383 1.469606
H  1.625683 1.043096 -1.242895
H  1.304478 2.296006 -0.022052
H  -3.724141 1.255705 -0.128293
H  -3.432783 0.016221 -1.366407
H  2.888884 1.073506 1.598343
H  3.691674 1.658506 0.111381
H  -4.422598 -1.743295 0.165497
H  -4.718572 -0.502334 1.399243
H  3.118185 -1.629243 1.186204
H  -5.987755 -0.53061 -1.437845
H  -6.827729 -0.963029 0.079225
H  -6.286506 0.717857 -0.196653
H  5.869978 -1.161106 0.155338
