program: Gaussian 09
title: 000157428
version: EM64L-G09RevD.01
frameworkgroup: C1[X(C24H20)]
method: RPBEPBE
basis: SDD
operation: Freq
keyword: #p
keyword: freq=noraman
keyword: PBEPBE/SDD
title: #p freq=noraman PBEPBE/SDD
converged: YES YES NO NO
title: Mulliken charges:
elementType: C C C C C C C C C C C C C C C C C C C C C C C C H H H H H H H H H H H H H H H H H H H H
charge: 0.146166 0.326056 -0.014040 0.347665 -0.017149 0.494040 0.345690 0.526218 -0.419225 -0.752342 -0.720591 -0.720891 -0.480756 0.144820 -0.551247 -0.547657 -0.487483 0.472046 -0.512902 -0.829318 -0.344740 -0.461432 -0.264476 -0.252277 0.252902 0.219205 0.218630 0.218683 0.223003 0.207868 0.233433 0.207943 0.222885 0.233740 0.224295 0.236888 0.221539 0.240047 0.243036 0.245233 0.223602 0.244871 0.226945 0.229078
chargesum: 0.00000
title: Mulliken charges with hydrogens summed into heavy atoms:
elementType: C C C C C C C C C C C C C C C C C C C C C C C C
charge: 0.146166 0.326056 -0.014040 0.347665 -0.017149 0.494040 0.345690 0.526218 -0.166323 -0.095823 -0.056287 -0.056323 -0.256461 0.144820 -0.314359 -0.326118 -0.247435 0.472046 -0.269866 -0.584085 -0.121137 -0.216562 -0.037531 -0.023199
polarizability: 4.89938850e+02 -3.17404637e+01 2.96449109e+02 2.01129722e-03 -5.73413507e-04 1.20601731e+02
1716.lowfreq: -9.7537 -8.4322 -0.0006 -0.0005 -0.0003 5.0473 38.3841 56.8016 92.6980
frequency: 38.3816 56.7737 92.6913 97.1569 134.3790 156.0456 164.4577 186.8347 204.4034 225.4313 228.8160 279.9192 280.0598 288.5709 311.4093 354.0516 354.5196 360.8712 385.2103 392.3463 422.0225 449.9054 465.5754 478.8852 485.2997 517.5923 519.1180 534.9677 544.0526 549.0881 563.1417 593.6635 625.6419 630.6556 649.0220 691.9345 699.4388 735.9003 757.1530 775.6830 778.0783 802.1862 811.3111 841.7656 842.8118 858.0494 858.5874 861.0526 878.6193 883.6596 919.8886 925.1626 938.6121 943.9685 959.8421 964.6181 980.3085 987.0769 991.3111 1007.3984 1024.6559 1029.5452 1030.0381 1050.0114 1112.1473 1130.3200 1147.2644 1159.2184 1177.6579 1187.1466 1197.7618 1208.0956 1214.4612 1222.6456 1254.4484 1258.0124 1264.8511 1289.2893 1318.5360 1327.5613 1356.1915 1375.8986 1381.3805 1384.5635 1404.0231 1408.4325 1409.6018 1421.6502 1429.1754 1442.0919 1459.7740 1463.7614 1471.1724 1475.0051 1476.6449 1480.3097 1492.4352 1503.5374 1512.4754 1520.0223 1559.4183 1577.3641 1601.0055 1610.6895 1624.7808 1634.7672 2974.6829 2979.2261 2983.0517 3065.5149 3067.2845 3075.2554 3075.7313 3101.7655 3104.1533 3117.2014 3119.5531 3121.9920 3125.5068 3132.1187 3144.3163 3145.2420 3153.7110 3165.3333 3181.0156 3203.5033
redmass: 3.7410 3.8241 3.8186 3.6814 3.7287 1.4251 2.1264 1.2491 3.5027 3.9287 2.5336 4.0923 4.0426 3.4193 3.4227 1.2823 4.7550 2.4312 3.4299 2.5723 4.0668 3.1384 3.1986 4.8370 3.3370 3.7178 5.6167 3.0549 5.2344 5.3276 3.1416 5.7020 3.9594 5.8303 5.5154 3.4717 6.1985 2.9103 1.2930 4.8094 1.9874 4.4353 1.3816 4.6911 2.1075 3.4794 1.9053 1.6970 1.9037 5.6210 1.7435 1.7410 1.8628 1.3269 1.3851 1.4367 1.3485 1.3815 1.4370 2.3694 2.6719 2.0968 1.3745 3.1807 2.5757 2.1735 2.0166 1.3575 1.1052 1.4051 2.9746 2.2400 1.4402 1.5671 1.8511 2.1791 2.0489 2.1161 2.7330 3.1971 2.7954 1.2092 1.1733 5.0621 2.5009 1.6478 1.6196 5.1176 4.2917 3.1014 1.0532 3.2605 1.0990 1.0490 2.8755 1.1604 1.0502 1.1345 3.7465 3.5900 5.2373 7.7785 6.0231 6.9444 6.5857 6.9979 1.0353 1.0371 1.0379 1.0999 1.0993 1.0984 1.1002 1.0969 1.0966 1.0898 1.0869 1.0863 1.0901 1.0884 1.0983 1.0929 1.0913 1.0986 1.0912 1.0917
irintensity: 0.2249 0.0000 0.6608 0.6853 0.2544 0.0036 0.7215 0.4644 0.5144 6.4916 0.2848 0.4560 0.1377 0.2516 0.0478 0.0031 0.1648 0.0009 0.3352 0.6021 0.5936 2.9957 1.9683 0.7528 1.5002 0.7061 1.7741 3.8496 1.5740 4.1748 2.9756 0.2147 7.0149 3.4123 2.2228 0.1263 0.2176 4.1015 64.4843 6.3316 37.7850 2.5496 6.7047 2.2042 2.1485 8.6766 3.8481 11.3617 50.0077 0.1748 2.5947 4.6649 27.3868 6.2644 6.2199 9.7663 1.4968 0.0781 2.8336 6.2366 4.0650 6.5472 0.0235 3.1868 2.9423 3.9548 13.3078 18.2744 1.9756 9.7341 6.6600 12.0851 3.5000 2.2774 8.1718 30.7525 11.4076 0.9270 1.5605 1.5652 9.4011 20.0093 21.0124 2.7637 15.3068 14.2578 0.4448 5.7155 2.3714 1.3952 0.1289 11.6720 1.8967 1.8403 9.3457 7.2773 9.7930 24.9262 2.5398 0.5785 8.2990 1.7822 1.1976 6.0654 3.6597 2.2686 22.5692 35.6064 66.5798 6.4780 3.0157 105.1666 41.9155 1.1221 62.7691 3.6308 1.7317 5.1560 11.6374 7.9700 33.9614 16.4811 26.5174 46.7624 22.4980 17.5138
temp: 298.150 k
press: 1.00000 atm
elementType: 6 6 6 6 6 6 6 6 6 6 6 6 6 6 6 6 6 6 6 6 6 6 6 6 1 1 1 1 1 1 1 1 1 1 1 1 1 1 1 1 1 1 1 1
symmnumber: 1
zpe: 947630.1 jmol-1
zpe.correction: 0.360933 hartree
zpe.thermalcorrener: 0.379666 hartree
zpe.thermalcorrenthalpy: 0.380610 hartree
zpe.thermalcorrgfe: 0.315604 hartree
zpe.sumelectzpe: -924.977477 hartree
zpe.sumelectthermal: -924.958745 hartree
zpe.sumelectthermalent: -924.957800 hartree
zpe.sumelectthermalfe: -925.022806 hartree
dipole: -0.7501 -0.3384 0.0019
dipole: 0.8229
quadrupole: -120.7813 -123.9754 -149.5424
quadrupole: 0.9480 -0.0038 -0.0010
quadrupole: 10.6518 7.4577 -18.1094 0.9480 -0.0038 -0.0010
hfenergy: -925.3384106 hartree
pointgroup: C01 [X(C24H20)]
dipole: 0.289503 0.1449377 0.0021362 debye
polarizability: 492.1796923|-23.8439132|294.2031396|0.8735254|0.6711992|120.6068586 unknown
InChI: InChI=1S/C24H20/c1-24(2,3)21-13-10-15-8-9-17-14-16-6-4-5-7-18(16)19-11-12-20(21)22(15)23(17)19/h4-14H,1-3H3
charge 0 multiplicity 1
44 atoms
C  4.10961 1.350147 0.015688
C  3.087407 0.174679 0.007746
C  0.764898 -0.792794 -0.002172
C  1.648638 0.359012 0.005006
C  -0.672384 -0.630931 -0.005138
C  1.31759 -2.127017 -0.006217
C  -1.264628 0.674905 -0.000936
C  -1.532498 -1.807903 -0.012296
C  3.570459 -1.154744 0.003811
C  5.582252 0.843692 0.016513
C  3.95843 2.210046 1.312423
C  3.964554 2.223583 -1.272619
C  1.004271 1.653541 0.009591
C  -2.71132 0.825779 -0.004224
C  2.720034 -2.27913 -0.002931
C  -0.373364 1.802347 0.006787
C  0.43714 -3.278671 -0.013344
C  -3.541269 -0.362519 -0.011369
C  -0.931016 -3.127089 -0.016275
C  -2.926984 -1.650128 -0.015148
C  -3.366163 2.10044 -0.000766
C  -4.9708 -0.228867 -0.014565
C  -4.76076 2.204182 -0.004028
C  -5.574508 1.028474 -0.010964
H  4.647097 -1.334533 0.006038
H  6.259167 1.717558 0.021217
H  5.81427 0.240031 0.9130
H  5.817709 0.246971 -0.883721
H  4.159379 1.5877 2.203865
H  4.692914 3.037598 1.299826
H  2.955945 2.647655 1.438238
H  4.695184 3.054118 -1.24507
H  4.175301 1.612092 -2.169338
H  2.961099 2.657928 -1.40151
H  1.611296 2.558109 0.01591
H  3.150698 -3.2875 -0.005719
H  -0.783506 2.816227 0.010949
H  0.891461 -4.276362 -0.016352
H  -1.593752 -4.000257 -0.02166
H  -3.567161 -2.541333 -0.020464
H  -2.772503 3.019414 0.004451
H  -5.582411 -1.138997 -0.019928
H  -5.234722 3.191956 -0.001268
H  -6.666052 1.120593 -0.01344
