program: Gaussian 09
title: 000157397
version: EM64L-G09RevD.01
frameworkgroup: C1[X(C20H30O4)]
method: RPBEPBE
basis: SDD
operation: Freq
keyword: #pfreq=noraman
keyword: PBEPBE/SDD
title: #p freq=noraman PBEPBE/SDD
converged: YES YES NO NO
title: Mulliken charges:
elementType: O O O O C C C C C C C C C C C C C C C C C C C C H H H H H H H H H H H H H H H H H H H H H H H H H H H H H H
charge: -0.490798 -0.287565 -0.218683 -0.304792 -0.211725 0.325185 0.256873 -0.584887 -0.524959 -0.122357 -0.143259 -0.791810 0.118209 -0.625849 -0.714275 -0.721047 0.544081 -0.510228 -0.847002 0.210111 0.226959 -0.770282 -0.217175 -0.733509 0.236360 0.262570 0.212298 0.221806 0.249619 0.276278 0.214065 0.239442 0.275974 0.205251 0.231444 0.230622 0.360207 0.208607 0.202017 0.242756 0.220853 0.214774 0.212996 0.248611 0.234717 0.238953 0.239601 0.214384 0.245271 0.234484 0.259058 0.239839 0.225711 0.240216
chargesum: 0.00000
title: Mulliken charges with hydrogens summed into heavy atoms:
elementType: O O O O C C C C C C C C C C C C C C C C C C C C
charge: -0.130591 -0.287565 -0.218683 -0.304792 0.024635 0.325185 0.256873 -0.110019 -0.053534 0.153921 0.070806 -0.071143 0.118209 -0.163783 -0.060894 -0.072424 0.544081 -0.261616 -0.133732 0.210111 0.226959 -0.076142 0.041883 -0.027742
polarizability: 2.92383652e+02 -3.57164166e+00 2.21274476e+02 4.45752659e+00 8.46665160e+00 1.77357089e+02
1716.lowfreq: -5.2808 -0.0004 -0.0002 0.0006 2.6000 7.5244 24.6657 31.4303 37.1943
frequency: 24.5380 31.3554 37.1838 44.5491 60.2863 77.0725 109.3822 114.9301 121.7710 125.7008 127.2353 148.4650 158.0739 174.4505 185.9329 190.7122 199.0358 203.9750 209.2638 226.4288 235.8165 254.4090 267.7341 280.6089 290.9695 310.3192 321.2386 335.2882 340.5600 369.1500 381.8939 399.0873 412.5733 422.2152 435.2582 446.3696 462.1800 489.1339 516.1134 545.5126 562.0766 579.5081 623.0598 640.5265 659.7920 690.1075 695.0202 713.6342 733.3919 760.9639 792.3086 809.8923 838.0311 853.3178 861.4966 878.0096 881.4017 892.0849 912.8275 920.2259 930.4122 940.8387 941.5951 951.9653 970.2358 1004.9241 1018.8281 1022.7263 1027.2550 1041.1350 1045.1582 1045.4787 1049.6024 1050.6145 1066.6899 1081.8851 1113.4746 1123.9627 1133.3746 1146.3117 1149.4607 1157.3291 1174.9173 1184.2568 1202.1405 1226.3835 1231.8580 1237.6718 1242.3630 1258.3238 1288.8369 1294.0058 1297.0931 1307.6097 1312.5830 1318.4873 1325.1817 1342.2146 1362.5281 1378.1785 1379.0785 1383.9366 1388.3832 1391.0669 1394.1509 1397.1146 1405.0017 1455.0260 1456.1559 1457.9181 1461.8316 1462.7004 1463.2741 1464.4126 1466.8862 1468.0019 1473.2643 1476.8358 1484.3377 1487.7410 1490.3047 1496.5644 1550.5991 1566.4940 1644.8126 1666.0491 2961.0940 2972.2087 2974.6388 2980.8864 2985.2537 2988.6016 2990.7539 2997.5013 3008.5009 3010.5736 3024.9720 3033.0824 3039.5868 3040.9408 3060.9559 3062.9145 3067.1263 3069.1019 3073.0170 3075.4489 3077.1905 3089.3371 3091.3677 3093.5099 3096.7536 3101.0123 3104.0842 3111.1305 3115.3805 3319.5860
redmass: 3.8450 3.7154 3.0273 2.4934 3.3197 3.9539 5.2876 1.1961 2.2901 1.2038 2.9066 2.8157 3.3172 1.7590 1.3022 1.2848 1.4389 1.5781 2.3104 2.7599 3.3000 2.9838 3.5699 3.8980 3.1434 2.8851 3.2100 4.2389 3.2874 2.5471 3.6813 2.9927 2.7571 3.1947 3.9125 3.2293 2.8740 3.3669 3.4638 3.9995 3.9124 3.2182 2.9431 3.5346 3.5151 2.4321 1.4738 2.8357 3.0557 4.8640 3.1831 3.9862 2.2077 3.2938 2.4920 1.6928 2.2159 1.2510 1.3672 1.7433 1.9438 1.8402 2.0052 1.4405 1.8489 2.3034 1.7875 1.8771 1.9832 2.3693 1.5109 1.8051 1.6342 2.1440 2.4844 2.2902 2.2377 2.6422 2.4133 2.0326 2.1305 2.9642 1.8807 2.5446 1.4725 1.8600 1.4354 1.8002 2.1809 2.1342 1.3911 1.4360 1.4129 1.3631 1.4511 1.4636 1.4067 1.4833 1.4536 1.3439 1.2473 1.2850 1.2233 1.4239 1.3075 1.2850 1.2558 1.0677 1.0633 1.0469 1.0621 1.0492 1.0678 1.0621 1.0651 1.0556 1.0946 1.0745 1.0565 1.0735 1.0544 1.0589 9.3439 10.0896 6.6410 6.1914 1.0376 1.0388 1.0358 1.0366 1.0814 1.0353 1.0376 1.0666 1.0746 1.0672 1.0618 1.0959 1.0954 1.0846 1.1004 1.0993 1.0971 1.0985 1.0990 1.0974 1.0993 1.0989 1.1003 1.0944 1.0984 1.1009 1.0975 1.0900 1.0926 1.0679
irintensity: 1.4283 0.8882 0.3535 0.1716 1.5200 1.2584 5.6318 0.1707 1.4696 0.2602 2.7175 0.8535 0.4629 0.8181 0.4637 0.2919 0.4322 0.8369 0.5162 1.7283 2.1237 3.5173 3.1260 3.1080 9.0302 1.5897 4.9616 0.9984 4.6700 3.1964 0.0284 0.7837 0.6957 0.3238 7.7390 7.3599 3.3853 6.6805 6.1491 4.5586 1.9577 1.7089 0.8358 2.8720 34.3623 14.1503 140.7273 3.2392 3.1762 1.5274 10.5168 1.8081 2.6473 16.2983 1.7886 32.4897 10.6021 15.3140 2.6694 7.2553 23.6325 4.0116 31.0065 2.3605 3.8918 68.4165 46.4478 2.1368 23.5879 5.4996 6.0805 22.8805 0.2612 2.9709 273.5837 18.2230 7.7403 9.3471 8.3229 23.2498 3.1517 98.7636 6.3791 10.4619 17.4565 43.3930 21.4757 62.4807 161.2999 65.7213 7.4148 4.5252 20.7602 5.0463 2.2088 15.2133 3.0968 12.9418 6.0221 40.3591 25.0989 5.0715 38.9923 13.5234 16.7551 39.3562 23.5670 19.9674 1.0398 0.8042 17.6552 32.7385 22.0002 8.8330 3.2575 4.3999 9.9378 15.8327 22.7898 3.7122 15.8573 14.9771 148.9516 177.1336 70.4768 66.4898 18.7431 18.8388 23.2156 36.7077 20.9229 29.1720 16.5393 18.0994 15.3991 9.4025 25.6735 15.3727 12.4355 15.7339 14.8305 1.0911 15.5715 79.5643 26.6867 14.9451 50.4042 21.9823 25.5696 8.3514 22.7660 6.4147 26.2155 13.8527 22.9087 267.0340
temp: 298.150 k
press: 1.00000 atm
elementType: 8 8 8 8 6 6 6 6 6 6 6 6 6 6 6 6 6 6 6 6 6 6 6 6 1 1 1 1 1 1 1 1 1 1 1 1 1 1 1 1 1 1 1 1 1 1 1 1 1 1 1 1 1 1
symmnumber: 1
zpe: 1203627.4 jmol-1
zpe.correction: 0.458437 hartree
zpe.thermalcorrener: 0.484921 hartree
zpe.thermalcorrenthalpy: 0.485865 hartree
zpe.thermalcorrgfe: 0.402622 hartree
zpe.sumelectzpe: -1079.141960 hartree
zpe.sumelectthermal: -1079.115476 hartree
zpe.sumelectthermalent: -1079.114532 hartree
zpe.sumelectthermalfe: -1079.197775 hartree
dipole: -5.9327 3.1072 1.4496
dipole: 6.8522
quadrupole: -149.6683 -140.7729 -147.9094
quadrupole: -6.6571 -6.8887 -5.4437
quadrupole: -3.5514 5.3439 -1.7925 -6.6571 -6.8887 -5.4437
hfenergy: -1079.6003973 hartree
pointgroup: C01 [X(C20H30O4)]
dipole: -2.5811205 0.1640307 0.7606508 debye
polarizability: 284.9732674|22.7794209|224.6898754|-1.9035842|15.5856048|181.3520746 unknown
InChI: InChI=1S/C20H30O4/c1-7-14(5)18(22)24-15-10-13(4)11-16(21)19(6)8-9-20(23,12(2)3)17(15)19/h7,11-12,15,17,23H,8-10H2,1-6H3
charge 0 multiplicity 1
54 atoms
O  0.86493 -1.707056 -1.753058
O  -1.389657 0.360157 0.068386
O  3.936809 2.370068 0.828354
O  -1.903585 -1.197726 -1.590137
C  1.084922 0.076859 0.01563
C  1.279738 -1.45925 -0.355364
C  2.4777 0.75234 -0.258517
C  2.824035 -1.674955 -0.339765
C  3.448837 -0.378582 0.215332
C  -0.114602 0.768953 -0.649363
C  0.511084 -2.437221 0.606836
C  2.767629 1.06463 -1.757971
C  2.737531 2.017679 0.592955
C  -0.120339 2.313236 -0.571152
C  0.634824 -3.906298 0.130776
C  0.948833 -2.325267 2.088783
C  0.349467 2.931282 0.739797
C  1.629036 2.791456 1.210614
C  -0.659666 3.793771 1.465894
C  -2.227047 -0.570089 -0.537257
C  -3.510611 -0.730696 0.210422
C  -3.731374 0.125802 1.440175
C  -4.3852 -1.657717 -0.293009
C  -5.740606 -2.032726 0.238726
H  0.921504 0.148057 1.108534
H  3.138466 -1.859214 -1.380885
H  3.120668 -2.558993 0.249312
H  3.473932 -0.400218 1.322053
H  4.479186 -0.199042 -0.131414
H  -0.215489 0.455026 -1.704058
H  -0.563836 -2.167922 0.56129
H  3.821688 1.377355 -1.85806
H  2.588993 0.169353 -2.376663
H  2.144404 1.881451 -2.1635
H  -1.148898 2.647276 -0.796762
H  0.513572 2.690671 -1.394222
H  -0.135348 -1.656292 -1.818052
H  1.67037 -4.278795 0.242096
H  -0.022558 -4.560488 0.733336
H  0.355955 -4.005794 -0.9314
H  2.021262 -2.566746 2.211588
H  0.376959 -3.046469 2.701704
H  0.773615 -1.320886 2.51408
H  1.936851 3.359579 2.099386
H  -1.005804 4.628465 0.824295
H  -0.252962 4.220097 2.398075
H  -1.55916 3.195549 1.713852
H  -4.70493 -0.081321 1.912308
H  -2.937724 -0.046811 2.189035
H  -3.692344 1.200365 1.184198
H  -4.05667 -2.190897 -1.197589
H  -6.515082 -1.861989 -0.534841
H  -6.030304 -1.476591 1.144521
H  -5.773105 -3.115225 0.472098
