program: Gaussian 09
title: 000157312
version: EM64L-G09RevD.01
frameworkgroup: C1[X(C10H17NO2)]
method: RPBEPBE
basis: SDD
operation: Freq
keyword: #p
keyword: freq=noraman
keyword: PBEPBE/SDD
title: #p freq=noraman PBEPBE/SDD
converged: YES YES NO NO
title: Mulliken charges:
elementType: O O N C C C C C C C C C C H H H H H H H H H H H H H H H H H
charge: -0.188741 -0.195863 -0.128567 0.187790 -0.526761 -0.313377 0.135979 -0.339276 -0.384215 -0.142808 -0.702450 -0.685682 -0.565889 0.232120 0.250857 0.232200 0.230229 0.175072 0.238078 0.222050 0.238500 0.269564 0.244372 0.210106 0.213411 0.217810 0.220507 0.218538 0.221868 0.214579
chargesum: 0.00000
title: Mulliken charges with hydrogens summed into heavy atoms:
elementType: O O N C C C C C C C C C C
charge: -0.188741 -0.195863 -0.128567 0.187790 -0.043784 0.149051 0.135979 0.073874 0.076334 0.126756 -0.034561 -0.028828 -0.129442
polarizability: 1.26075843e+02 -1.16277370e+01 1.22854493e+02 -4.51355344e+00 6.32166212e-01 1.05055633e+02
1716.lowfreq: -27.7425 -0.0001 0.0006 0.0007 2.4886 7.8399 28.5011 52.3278 83.0285
frequency: 26.1627 52.0115 83.0016 84.6322 111.4776 152.5736 166.1864 188.8959 211.0424 239.7702 255.9871 279.1248 301.0023 335.1962 347.5078 394.8101 439.8414 469.7641 537.7075 567.6264 615.7113 653.2341 673.1950 686.3589 764.7931 789.8300 806.6146 844.6801 891.1583 913.0130 935.4756 945.5406 958.6789 989.7701 1008.3158 1030.2714 1034.4323 1056.6678 1075.2135 1087.8364 1107.3998 1111.8202 1154.2797 1180.8686 1192.5885 1210.0201 1225.7143 1282.8150 1295.3686 1302.2200 1337.0660 1338.8556 1348.7641 1372.5527 1377.0546 1385.7768 1417.7439 1458.9151 1463.5130 1471.3406 1475.0920 1479.0905 1481.5308 1483.8060 1492.9557 1646.0929 1695.6861 2870.7368 2977.8369 2986.8587 3000.3408 3024.7119 3028.5603 3039.1121 3047.3455 3071.1938 3079.0876 3083.8914 3086.0707 3096.3856 3098.2227 3107.6597 3113.4871 3199.2037
redmass: 2.3569 3.2808 3.7226 2.7315 3.3508 2.0189 3.0456 2.8818 1.1766 1.8162 2.9665 1.8439 2.2588 2.9802 2.1450 3.3495 3.5724 2.7283 3.1130 3.4215 2.5327 5.7194 4.4888 2.7223 1.1842 1.3964 1.6734 2.3392 3.4377 2.3675 1.3439 1.6236 3.1772 2.3432 2.7370 1.5592 1.5950 2.1575 2.0566 3.5612 2.1508 1.6828 1.9117 1.9054 1.4309 2.1676 2.7229 1.2176 1.2429 1.2528 1.2841 1.3169 1.2158 1.3266 1.2298 1.2255 1.1918 1.0608 1.0662 1.0749 1.0471 1.0612 1.0775 1.0724 1.0712 4.6581 12.0001 1.0713 1.0353 1.0363 1.0609 1.0588 1.0630 1.0869 1.1006 1.0985 1.0987 1.1012 1.1022 1.0602 1.1007 1.1082 1.0936 1.1135
irintensity: 0.5425 0.8770 1.2684 0.7480 1.2011 2.6008 3.5585 1.5971 0.3801 0.2478 3.8185 0.5919 0.2704 1.3546 0.0576 1.5685 1.1152 9.2072 4.2028 0.8417 8.4040 3.6010 2.0888 5.3423 8.3871 12.4909 6.7532 13.7203 20.0202 16.8694 64.0014 15.8998 46.7226 24.4713 14.1744 15.6540 89.0572 20.9009 5.0465 61.7565 32.8025 20.7333 19.8719 24.2822 21.0111 29.6533 20.3430 1.6769 13.2817 21.0565 1.7636 3.9864 4.7757 14.5119 22.3975 21.8596 8.5865 11.0040 8.3083 7.1297 9.8250 2.6495 21.3693 6.3932 3.7823 28.2166 235.2112 85.0160 25.0511 24.9707 39.7687 26.0809 34.4046 7.2567 4.9393 47.6430 42.1498 38.6366 30.2022 7.6026 29.6485 30.3925 2.7808 18.6774
temp: 298.150 k
press: 1.00000 atm
elementType: 8 8 7 6 6 6 6 6 6 6 6 6 6 1 1 1 1 1 1 1 1 1 1 1 1 1 1 1 1 1
symmnumber: 1
zpe: 668142.8 jmol-1
zpe.correction: 0.254482 hartree
zpe.thermalcorrener: 0.269033 hartree
zpe.thermalcorrenthalpy: 0.269977 hartree
zpe.thermalcorrgfe: 0.212788 hartree
zpe.sumelectzpe: -595.380566 hartree
zpe.sumelectthermal: -595.366015 hartree
zpe.sumelectthermalent: -595.365071 hartree
zpe.sumelectthermalfe: -595.422259 hartree
dipole: 1.0876 4.2822 2.9219
dipole: 5.2969
quadrupole: -78.3565 -85.1512 -77.9981
quadrupole: -8.4654 -3.1978 -5.3299
quadrupole: 2.1454 -4.6493 2.5038 -8.4654 -3.1978 -5.3299
hfenergy: -595.6350479 hartree
pointgroup: C01 [X(C10H17N1O2)]
dipole: -0.3934588 1.6297605 -1.2377225 debye
polarizability: 126.5038552|11.3329952|122.3889035|-4.9721169|-1.3808365|105.0932109 unknown
InChI: InChI=1S/C10H17NO2/c1-4-10(11(5-2)6-3)7-8-13-9(10)12/h4H,1,5-8H2,2-3H3
charge 0 multiplicity 1
30 atoms
O  2.161845 -1.305542 -0.51774
O  0.859732 -1.932417 1.290211
N  -1.11839 0.02791 0.221897
C  0.334953 0.217133 0.044127
C  0.853864 0.529933 -1.400013
C  2.234502 -0.151282 -1.471057
C  1.092457 -1.127992 0.377837
C  -1.728184 -1.09791 -0.5256
C  -1.943612 1.255596 0.324536
C  0.858514 1.17322 1.121462
C  -3.027306 -1.612012 0.125535
C  -2.284874 1.984483 -1.004104
C  1.663561 2.250313 0.952373
H  0.911742 1.609443 -1.613168
H  0.163277 0.074077 -2.130689
H  2.481078 -0.579723 -2.454791
H  3.054419 0.502357 -1.12684
H  -1.932679 -0.844263 -1.595125
H  -1.002653 -1.930708 -0.530542
H  -2.885708 0.983633 0.835425
H  -1.421235 1.959884 0.996397
H  0.535588 0.879991 2.130788
H  -2.841932 -1.865418 1.183385
H  -3.845235 -0.870589 0.079019
H  -3.373973 -2.521212 -0.399061
H  -1.37584 2.350912 -1.513451
H  -2.832611 1.327285 -1.704352
H  -2.929279 2.859011 -0.794963
H  1.995646 2.837793 1.815223
H  2.014433 2.590495 -0.028918
