program: Gaussian 09
title: 000157298
version: EM64L-G09RevD.01
frameworkgroup: C1[X(C13H20N2O)]
method: RPBEPBE
basis: SDD
operation: Freq
keyword: #p
keyword: freq=noraman
keyword: PBEPBE/SDD
title: #p freq=noraman PBEPBE/SDD
converged: NO YES NO NO
title: Mulliken charges:
elementType: O N N C C C C C C C C C C C C C H H H H H H H H H H H H H H H H H H H H
charge: -0.317025 -0.507570 -0.166338 -0.248306 0.442084 0.310492 -0.401072 -0.696460 -0.696547 -0.687866 0.503483 -0.400042 -0.854610 0.298131 -0.632137 -0.670683 0.222659 0.225563 0.214299 0.208884 0.223551 0.223552 0.208899 0.214273 0.212019 0.307380 0.232474 0.225974 0.232461 0.321081 0.222273 0.222425 0.289746 0.247272 0.234911 0.234770
chargesum: 0.00000
title: Mulliken charges with hydrogens summed into heavy atoms:
elementType: O N N C C C C C C C C C C C C C
charge: -0.317025 -0.186490 -0.166338 -0.025647 0.442084 0.310492 -0.175509 -0.049726 -0.049824 -0.475847 0.503483 -0.092662 -0.163700 0.298131 0.102306 0.046271
polarizability: 2.49036921e+02 -1.80035090e+00 1.57411150e+02 4.14442990e-02 -1.13429944e-01 9.87383362e+01
1716.lowfreq: -11.2410 -5.9046 -1.2545 -0.0007 0.0001 0.0004 19.6047 29.1907 41.0930
frequency: 17.4881 28.8318 41.0605 75.4190 94.4379 94.7338 121.0656 165.8044 172.0085 176.8154 201.5370 209.0098 223.5935 233.6295 252.0758 256.4851 261.2151 296.6162 376.4364 400.8317 415.3145 430.5610 462.0295 505.0482 509.1725 553.2269 602.5606 606.1958 608.0909 702.5151 711.3991 747.8815 753.8739 855.8120 856.9532 864.7993 882.9562 914.4988 931.0148 952.3061 984.6305 987.8109 1026.4391 1038.8494 1056.5540 1059.7953 1089.8455 1095.3688 1114.0212 1135.1864 1157.9132 1166.3054 1187.3753 1224.5226 1257.3288 1267.6895 1300.7753 1309.5619 1322.9712 1338.0503 1375.2988 1379.3970 1393.0529 1396.5987 1405.6393 1417.0295 1447.5314 1464.6312 1468.7418 1472.8486 1474.3989 1478.4457 1480.2862 1481.8763 1486.0661 1494.0008 1496.3713 1505.4116 1516.5857 1591.7014 1620.5343 1628.7280 2934.9646 2961.1013 2970.8357 2971.6147 2973.4882 3001.7523 3006.9220 3033.7974 3047.6981 3064.4998 3071.4642 3073.0828 3076.1203 3079.1639 3086.2299 3095.8413 3113.3197 3121.2464 3196.4297 3549.1684
redmass: 2.6911 2.9615 3.7928 2.0439 3.2849 3.3557 1.9952 1.1860 1.0874 3.0633 1.9980 2.1119 1.2429 2.7076 1.2364 3.1813 3.4844 2.9241 3.5043 2.7216 3.5798 3.1878 2.8481 4.2109 3.2174 1.3180 4.4597 2.6910 4.6154 11.2587 3.4681 2.9653 5.6746 1.4029 6.2076 1.5748 2.5545 1.1783 3.8418 1.4572 1.3253 1.7435 1.9492 1.5422 1.5483 1.4244 2.2832 1.2316 2.6418 1.3301 1.9996 1.7848 1.6272 1.6338 5.4818 1.9725 2.3191 1.3026 2.2063 2.2165 1.1921 2.7735 1.2934 1.4836 2.2622 1.1514 1.1857 1.0447 1.0517 1.0467 1.2191 1.0492 1.0490 1.1094 1.0677 1.0453 1.1729 2.3469 2.1370 5.7928 4.7495 5.5587 1.0383 1.0366 1.0347 1.0375 1.0352 1.1017 1.0836 1.1024 1.0976 1.1002 1.0994 1.1004 1.0984 1.0988 1.0907 1.0940 1.0960 1.0895 1.0941 1.0751
irintensity: 0.8626 1.0905 1.1404 7.2854 1.3868 1.6391 0.6676 0.2888 0.5978 0.0979 2.1527 0.3793 1.1171 0.9279 0.0522 5.1993 0.1244 5.9820 21.3627 0.3724 1.9534 2.5091 2.8538 0.0032 0.6653 75.9792 7.7599 0.0035 0.2448 21.1432 0.6302 0.0568 0.3057 0.0124 1.3796 66.0126 2.7267 1.2278 8.5471 0.1614 3.7776 25.0026 12.9570 7.2027 45.8648 29.4250 16.4203 0.0441 2.9656 0.2138 78.6660 72.4371 63.2171 28.8744 23.3683 47.5426 22.2039 1.2663 45.0859 63.4960 16.0120 155.2166 22.0542 63.9725 10.6823 35.8876 34.4742 2.8282 2.0316 15.5711 61.3138 17.8534 23.3236 29.2559 5.7138 4.8296 247.5603 50.3395 439.6557 36.0392 133.8942 174.7426 55.4714 117.1072 34.7120 32.5747 43.1279 41.6439 12.8682 46.8513 19.7727 0.2361 101.0332 24.9594 40.6524 34.2241 43.2468 19.0845 0.8587 21.4353 5.9189 9.3147
temp: 298.150 k
press: 1.00000 atm
elementType: 8 7 7 6 6 6 6 6 6 6 6 6 6 6 6 6 1 1 1 1 1 1 1 1 1 1 1 1 1 1 1 1 1 1 1 1
symmnumber: 1
zpe: 805028.3 jmol-1
zpe.correction: 0.306619 hartree
zpe.thermalcorrener: 0.324800 hartree
zpe.thermalcorrenthalpy: 0.325744 hartree
zpe.thermalcorrgfe: 0.259104 hartree
zpe.sumelectzpe: -690.904758 hartree
zpe.sumelectthermal: -690.886577 hartree
zpe.sumelectthermalent: -690.885633 hartree
zpe.sumelectthermalfe: -690.952274 hartree
dipole: -1.7108 4.3978 0.0062
dipole: 4.7189
quadrupole: -73.8782 -95.0754 -101.6857
quadrupole: -10.6495 -0.0353 -0.0221
quadrupole: 16.3349 -4.8623 -11.4726 -10.6495 -0.0353 -0.0221
hfenergy: -691.2113771 hartree
pointgroup: C01 [X(C13H20N2O1)]
dipole: -0.6446639 1.7410236 0.0008271 debye
polarizability: 248.9534263|-3.2990924|157.494385|0.0478895|-0.1678021|98.7385964 unknown
InChI: InChI=1S/C13H20N2O/c1-9(2)12-7-6-11(8-10(12)3)14-13(16)15(4)5/h6-9,14H,1-5H3
charge 0 multiplicity 1
36 atoms
O  -2.693855 -1.714756 -0.004812
N  -1.843159 0.4857 -0.006051
N  -4.173099 0.102593 0.002763
C  3.928224 -0.286225 0.001896
C  2.410327 -0.064141 0.00013
C  1.826988 1.239816 -0.006077
C  1.536667 -1.180819 0.004071
C  4.396711 -1.039772 -1.273422
C  4.395431 -1.031304 1.282606
C  0.418057 1.364752 -0.007864
C  -0.441489 0.234117 -0.003863
C  0.133216 -1.062347 0.002132
C  2.674651 2.505183 -0.010752
C  -2.884622 -0.457734 -0.00333
C  -5.327084 -0.809401 -0.007194
C  -4.429391 1.549334 0.014123
H  4.42679 0.701142 -0.001098
H  1.965413 -2.190668 0.008558
H  3.956972 -2.053203 -1.319327
H  5.497891 -1.147504 -1.281266
H  4.092685 -0.501179 -2.189391
H  4.090625 -0.486591 2.194687
H  5.496595 -1.139054 1.292167
H  3.955645 -2.044395 1.334923
H  -0.020363 2.373244 -0.012516
H  -0.517541 -1.937875 0.004448
H  3.331276 2.558163 -0.89985
H  2.036137 3.405577 -0.015056
H  3.329845 2.565659 0.878919
H  -2.09689 1.473978 -0.013579
H  -5.953822 -0.649098 -0.906039
H  -5.953726 -0.669191 0.895076
H  -4.943148 -1.84097 -0.018171
H  -5.517647 1.717129 0.042899
H  -4.045611 2.054496 -0.897021
H  -4.000598 2.045647 0.90948
