program: Gaussian 09
title: 000157291
version: EM64L-G09RevD.01
frameworkgroup: C1[X(C10H12FNS)]
method: RPBEPBE
basis: SDD
operation: Freq
keyword: #p
keyword: freq=noraman
keyword: PBEPBE/SDD
title: #p freq=noraman PBEPBE/SDD
converged: YES YES NO NO
title: Mulliken charges:
elementType: S F N C C C C C C C C C C H H H H H H H H H H H H
charge: 0.170226 -0.206559 -0.286915 -0.567425 -0.307341 -0.375751 -0.689369 0.481566 -0.412201 -0.322638 -0.361325 -0.364317 0.317119 0.268579 0.231220 0.196965 0.182399 0.220350 0.261399 0.240771 0.287896 0.241116 0.283136 0.255832 0.255266
chargesum: 0.00000
title: Mulliken charges with hydrogens summed into heavy atoms:
elementType: S F N C C C C C C C C C C
charge: 0.170226 -0.206559 0.000980 -0.298846 0.120844 0.026998 -0.187199 0.481566 -0.171085 -0.039502 -0.105493 -0.109051 0.317119
polarizability: 1.87162215e+02 -3.58892213e-01 9.83343476e+01 5.77740143e-02 -7.81865937e+00 1.06879909e+02
1716.lowfreq: -7.9546 0.0005 0.0013 0.0028 4.8380 16.6008 41.9313 64.8702 70.5658
frequency: 40.6215 64.8312 70.5469 161.5095 179.0454 216.4019 236.8580 254.5959 332.1922 370.7924 380.6367 382.5281 414.2145 423.7089 500.0494 535.2976 555.0347 615.5132 621.6806 687.2697 733.7729 756.2824 819.6627 826.3637 838.1037 845.8172 854.6101 938.3736 946.5229 965.2711 993.0018 1005.6012 1035.6785 1080.5554 1100.9914 1151.6064 1153.2103 1164.9707 1188.6349 1198.0546 1203.2696 1234.4397 1260.3365 1282.3392 1289.3780 1327.9994 1344.6033 1355.3206 1390.8319 1406.2274 1435.0352 1440.2947 1444.7427 1467.3144 1493.9903 1601.5249 1611.8900 2858.5055 2903.6472 2979.4072 3000.0078 3046.2550 3059.6600 3087.0577 3137.8983 3155.1945 3175.6303 3178.5625 3515.5428
redmass: 4.2102 5.7147 4.9242 3.0715 7.2258 3.8365 3.1125 2.0396 2.2050 3.4260 3.6248 4.4471 2.9273 4.8074 3.3862 2.8020 2.9400 5.5395 6.8943 4.6391 3.8376 4.6688 1.2882 2.4600 2.4779 1.5713 1.9929 2.1702 1.3786 1.3588 2.6674 2.7391 1.5806 1.6934 1.3340 2.1770 1.4562 1.3979 1.6281 1.5038 1.7802 1.8010 1.2454 1.2209 1.2752 1.6827 1.3679 1.3145 5.6931 2.6355 1.3212 1.0895 1.1476 1.0962 2.8057 7.6649 6.5295 1.0711 1.0849 1.0626 1.0629 1.0896 1.0977 1.1027 1.0901 1.0889 1.0959 1.0969 1.0768
irintensity: 0.1916 0.8086 0.4816 0.8528 11.4605 28.6217 39.6715 19.9250 4.2992 9.4584 20.8922 0.2461 0.9174 3.2064 2.2010 23.8895 10.1516 4.3909 3.3556 26.3352 15.5280 15.6613 4.4499 19.2009 21.2394 44.0028 2.6350 5.9292 0.2711 0.4005 16.1569 11.5447 1.8579 9.4273 11.9952 32.5242 62.0326 5.2472 22.5468 18.7343 8.0971 13.4993 11.8058 25.3019 9.2286 15.6083 4.9705 34.9541 0.8202 1.5119 43.6841 12.5459 5.9409 9.6901 94.1051 6.8807 28.7570 106.6318 58.7206 43.4048 44.8736 41.1898 31.2154 20.2988 8.5726 3.2391 4.2411 2.3556 3.3445
temp: 298.150 k
press: 1.00000 atm
elementType: 16 9 7 6 6 6 6 6 6 6 6 6 6 1 1 1 1 1 1 1 1 1 1 1 1
symmnumber: 1
zpe: 522333.4 jmol-1
zpe.correction: 0.198946 hartree
zpe.thermalcorrener: 0.211022 hartree
zpe.thermalcorrenthalpy: 0.211967 hartree
zpe.thermalcorrgfe: 0.159973 hartree
zpe.sumelectzpe: -939.941461 hartree
zpe.sumelectthermal: -939.929384 hartree
zpe.sumelectthermalent: -939.928440 hartree
zpe.sumelectthermalfe: -939.980434 hartree
dipole: 2.9568 1.9933 1.9541
dipole: 4.0662
quadrupole: -86.0751 -84.0216 -79.8444
quadrupole: 2.7508 0.3132 -3.2316
quadrupole: -2.7614 -0.7079 3.4693 2.7508 0.3132 -3.2316
hfenergy: -940.1404068 hartree
pointgroup: C01 [X(C10H12F1N1S1)]
dipole: -1.1932647 -0.4481 0.966744 debye
dipolederiv: -0.3830802 0.0481752 -0.0855414 -0.0173408 -0.3151276 0.0746767 -0.0554175 0.1612646 -0.2809817 -1.255382 0.0864604 0.0946375 0.0912255 -0.1936317 -0.0367589 0.1245829 -0.0378116 -0.192007 -0.745834 -0.1467568 0.1418373 0.0033969 -0.6871992 0.1099421 0.1219398 -0.1643387 -0.4357071 0.4579827 0.0179568 0.0719089 0.0270798 0.7811705 -0.2734806 0.0522386 -0.2427228 0.5733489 -0.0711116 -0.052858 -0.0073123 0.0755669 0.0233003 0.019914 -0.0015112 0.0570635 0.0407403 0.603965 0.0662695 -0.1978165 -0.0842841 0.194189 0.1101951 -0.0873441 0.0785249 0.3588003 0.3412927 0.0241602 -0.0618487 0.060495 0.0793025 0.0636387 -0.1585052 0.0707415 0.0657348 0.135137 -0.0584824 0.0544609 -0.0601175 -0.107191 -0.0105847 -0.0262708 -0.0147011 -0.1085513 0.0591359 0.0185634 -0.0106409 0.0093377 0.0047083 0.1256758 0.0061433 0.1095213 -0.0328153 0.0784295 -0.0098891 -0.0099658 0.019747 -0.0525892 0.0803501 0.0380626 0.092264 -0.0296365 -0.2296863 0.0369369 0.0306715 0.1654667 -0.1080187 0.0354147 0.1687258 0.0351611 -0.1127163 -0.2814144 -0.0003527 -0.0169654 -0.1329855 -0.0713343 0.07361 -0.1289731 0.081305 -0.0738976 1.3317349 -0.0849398 -0.1073268 -0.093286 0.1965528 0.1066903 -0.1312001 0.1020007 0.1899965 -0.0396789 0.0601586 0.0031771 -0.0229221 -0.1139653 -0.05578 -0.0353611 -0.0423503 -0.1915223 0.1185042 0.0413666 0.0327763 -0.0005398 -0.0216981 -0.0687188 -0.0265977 -0.0838607 -0.0879696 -0.2302803 -0.0398318 0.0519028 -0.0665975 0.057265 0.0194236 0.0970027 0.0257212 0.0709587 -0.0979125 -0.0231059 0.0477419 0.1198368 -0.0072409 -0.1919481 0.1024951 -0.0650937 -0.1894074 0.0029309 -0.0416265 0.0205754 -0.0924974 -0.149418 0.0795826 0.0278712 0.0412739 0.0721166 -0.0823098 0.0560583 -0.0748834 0.0256406 0.0462273 0.0637197 -0.0602924 0.0794089 -0.0073122 -0.0480448 -0.0015045 0.0324397 -0.0169334 -0.0118439 -0.0654207 0.1279859 -0.1461354 -0.0781378 0.1222743 0.0144034 -0.0216444 0.0177845 0.1732735 0.0602791 -0.1322754 0.1857612 0.1261372 0.0678395 0.0592897 0.0682519 0.051283 0.0389821 -0.091967 0.0458243 -0.093663 0.0507671 0.0756167 -0.0550872 -0.0505155 -0.0629703 0.0780323 -0.0512159 -0.0719685 -0.0497472 0.0835858 0.0148237 -0.0536143 -0.045771 -0.0625711 0.0923913 -0.0809753 -0.0505106 -0.0807809 0.1070403 0.0550679 0.0382497 0.0398508 0.046185 0.0738628 -0.0962626 0.0533556 -0.0988064 0.0814355 unknown
polarizability: 187.0612221|-2.3310468|104.4232373|2.0187275|8.6847904|100.8920119 unknown
InChI: InChI=1S/C10H12FNS/c11-9-4-2-8(3-5-9)10-12-6-1-7-13-10/h2-5,10,12H,1,6-7H2
charge 0 multiplicity 1
25 atoms
S  -1.8092 1.176697 -1.140984
F  4.574347 -0.218578 -0.274787
N  -1.72426 -1.028125 0.576164
C  -1.084009 0.264293 0.42493
C  -3.99573 -0.443068 -0.275567
C  -3.162164 -1.031284 0.887291
C  -3.617133 1.017008 -0.580475
C  0.411914 0.142096 0.246487
C  1.299385 0.97106 0.975806
C  0.940049 -0.805161 -0.670388
C  2.697659 0.860029 0.808034
C  2.333593 -0.934713 -0.849173
C  3.179535 -0.096155 -0.101755
H  -1.329393 0.969237 1.251551
H  -3.846585 -1.061191 -1.179438
H  -5.069013 -0.488744 0.000972
H  -3.389209 -0.444454 1.813659
H  -3.475121 -2.074455 1.072429
H  -4.215075 1.434581 -1.407589
H  -3.754612 1.658044 0.310981
H  -1.153687 -1.734522 1.047675
H  0.897482 1.709896 1.678343
H  0.247085 -1.425639 -1.24704
H  3.39764 1.491053 1.362877
H  2.760905 -1.654804 -1.553101
