program: Gaussian 09
title: 000014188
version: EM64L-G09RevD.01
frameworkgroup: C1[X(C18H16N2O4)]
method: RPBEPBE
basis: SDD
operation: Freq
keyword: #p
keyword: freq=noraman
keyword: PBEPBE/SDD
title: #p freq=noraman PBEPBE/SDD
converged: YES YES NO NO
title: Mulliken charges:
elementType: O O O O N N C C C C C C C C C C C C C C C C C C H H H H H H H H H H H H H H H H
charge: -0.157052 -0.202071 -0.236989 -0.199035 -0.447142 -0.301782 -0.041414 0.440553 0.412072 0.120474 0.198040 -0.384927 -0.331792 -0.386516 -0.411091 0.298407 -0.236610 -0.236057 -0.236354 -0.224834 -0.240361 -0.241499 -0.210380 -0.670748 0.340769 0.256796 0.263084 0.258177 0.259047 0.231174 0.230301 0.233530 0.229451 0.234361 0.231834 0.235829 0.235042 0.211665 0.231787 0.244263
chargesum: 0.00000
title: Mulliken charges with hydrogens summed into heavy atoms:
elementType: O O O O N N C C C C C C C C C C C C C C C C C C
charge: -0.157052 -0.202071 -0.236989 -0.199035 -0.106373 -0.301782 -0.041414 0.440553 0.412072 0.120474 0.198040 -0.128131 -0.068708 -0.128339 -0.152045 0.298407 -0.005436 -0.005756 -0.002824 0.004617 -0.006000 -0.009665 0.260490 0.016967
polarizability: 2.50041071e+02 -2.85615178e-01 2.23726464e+02 1.22495961e+01 1.58971525e+01 1.70855110e+02
1716.lowfreq: -8.1173 -2.4688 -0.0007 -0.0002 0.0002 2.3003 18.5386 27.0846 31.4683
frequency: 18.5281 26.7688 31.3088 39.4468 56.5548 63.1215 66.6591 74.1030 98.7236 118.8087 140.7852 189.0427 215.2313 226.0893 233.1897 246.2132 257.8583 294.5438 303.0251 312.5136 339.6760 352.9320 399.5240 402.9530 440.2178 471.2652 499.3286 512.1721 543.0495 588.7481 605.0830 615.0114 615.7029 651.5379 668.6330 683.4898 700.5110 702.8473 706.3915 731.0501 751.6415 770.9708 780.6860 800.7848 807.1291 852.9847 857.5543 867.9575 905.4861 928.6096 932.9563 979.6999 982.2727 987.7966 990.3713 994.3458 999.7691 1000.7776 1022.1321 1028.1985 1031.1804 1070.1768 1077.1832 1090.1559 1106.8822 1115.3835 1135.9435 1142.4036 1173.0820 1175.9590 1180.6729 1191.5205 1199.0726 1207.1365 1229.9754 1253.3630 1297.7109 1316.3582 1328.5749 1357.7295 1360.2091 1378.0677 1382.8588 1402.3644 1435.1840 1438.1752 1461.5470 1473.2496 1478.8984 1482.9353 1485.9609 1590.6543 1594.1315 1608.3538 1610.6946 1626.8238 1689.5226 1732.4701 2999.3991 3014.7090 3076.0934 3096.1260 3113.9355 3123.9885 3127.5610 3132.8287 3136.4057 3143.5789 3147.7361 3153.8663 3156.0282 3168.0601 3168.2770 3591.6669
redmass: 4.7219 3.7233 3.6826 4.1697 5.4594 5.5624 3.8873 3.9030 4.2315 4.8687 8.7395 3.2596 3.6676 5.5532 2.9433 5.1412 2.3482 6.7199 6.8150 5.2882 5.7059 4.2328 2.8018 2.8288 5.7574 5.0433 3.8670 1.8128 2.2037 6.7557 10.1659 6.3770 6.3967 7.5195 7.0231 7.2786 3.6502 2.1164 1.7361 5.2151 9.4306 2.0286 2.1967 1.1843 3.3490 1.2498 1.2533 5.3942 4.3542 1.4881 1.6380 1.4018 1.4352 4.2926 6.0050 4.1795 1.3382 1.4079 2.6338 2.2272 2.3188 2.5498 5.7934 1.6336 2.8212 2.3020 1.4672 6.0591 1.1069 1.0552 2.1076 1.3514 1.2204 3.2985 6.1834 1.1339 9.5340 1.3407 1.3393 1.4735 1.5531 6.5369 9.4600 1.2627 2.2210 2.2275 1.0392 1.0661 2.2061 2.1589 1.0660 6.0525 6.3117 6.0114 5.9745 11.8822 12.1580 10.8489 1.0360 1.0580 1.1071 1.0985 1.1029 1.0865 1.0848 1.0873 1.0879 1.0917 1.0922 1.0961 1.0963 1.1015 1.1014 1.0796
irintensity: 0.9487 0.2370 0.5125 0.0942 0.8951 1.2236 1.3403 1.7273 1.4706 1.8584 1.9907 1.5939 1.8043 2.4797 2.9576 1.5345 0.8101 8.0482 5.2668 0.2860 2.4360 7.3021 0.0196 0.4027 2.0374 2.9197 10.9391 86.6277 57.1468 18.0441 33.4072 1.3866 0.4586 8.1549 20.3528 12.0126 6.8808 40.2966 54.3406 45.5997 52.6604 37.2401 34.7279 7.1013 4.2364 0.0812 1.6512 44.7869 7.4952 1.1184 3.8011 0.3072 2.1838 17.9221 2.4154 5.6362 0.0488 1.1441 102.7113 36.0154 72.6699 1.3051 79.5235 9.9166 84.9624 10.5365 4.2864 232.3225 3.1448 0.0571 11.7426 5.9974 1.2057 53.2305 260.0086 0.6154 657.0723 4.5592 5.7504 12.7894 21.4447 0.8173 0.2598 27.3756 20.1229 7.9467 13.4916 4.1044 16.6220 17.2848 18.1562 1.2281 0.2270 2.7674 1.9023 176.1572 562.9473 309.8594 17.4281 17.7292 5.9448 27.8420 33.2743 3.0451 0.3436 0.5172 3.9483 13.7338 17.3703 23.9327 23.5788 24.6623 14.5599 46.9666
temp: 298.150 k
press: 1.00000 atm
elementType: 8 8 8 8 7 7 6 6 6 6 6 6 6 6 6 6 6 6 6 6 6 6 6 6 1 1 1 1 1 1 1 1 1 1 1 1 1 1 1 1
symmnumber: 1
zpe: 799988.2 jmol-1
zpe.correction: 0.304699 hartree
zpe.thermalcorrener: 0.326227 hartree
zpe.thermalcorrenthalpy: 0.327171 hartree
zpe.thermalcorrgfe: 0.251150 hartree
zpe.sumelectzpe: -1104.243733 hartree
zpe.sumelectthermal: -1104.222206 hartree
zpe.sumelectthermalent: -1104.221261 hartree
zpe.sumelectthermalfe: -1104.297282 hartree
dipole: -2.0903 1.4546 1.9309
dipole: 3.1959
quadrupole: -112.3590 -126.6743 -148.8861
quadrupole: 5.7084 -3.9361 0.8991
quadrupole: 16.9475 2.6321 -19.5796 5.7084 -3.9361 0.8991
hfenergy: -1104.5484323 hartree
pointgroup: C01 [X(C18H16N2O4)]
dipole: -0.8780745 -0.3864031 -0.8128116 debye
polarizability: 249.874804|-1.6626283|219.51628|-10.1809022|22.6660394|175.2315611 unknown
InChI: InChI=1S/C18H16N2O4/c1-2-24-17(23)20-15(21)18(19-16(20)22,13-9-5-3-6-10-13)14-11-7-4-8-12-14/h3-12,19H,2H2,1H3
charge 0 multiplicity 1
40 atoms
O  0.366271 0.065813 2.045313
O  2.3268 0.877727 -2.190579
O  3.882778 -0.315826 -0.039394
O  3.256341 1.011093 1.784572
N  0.103167 0.468741 -1.485634
N  1.705922 0.394279 0.099639
C  -0.662388 0.246485 -0.239229
C  -1.649294 1.412476 -0.009234
C  -1.349819 -1.136656 -0.201322
C  0.492468 0.232979 0.8191
C  1.4711 0.599112 -1.32767
C  -2.887922 1.402136 -0.700854
C  -2.210322 -1.44876 0.881694
C  -1.316982 2.529284 0.795689
C  -1.098179 -2.112527 -1.19375
C  3.001058 0.421522 0.717634
C  -3.775036 2.494636 -0.597725
C  -2.82027 -2.718036 0.960037
C  -2.209718 3.619095 0.904427
C  -1.7168 -3.381873 -1.117156
C  -3.437916 3.608503 0.205922
C  -2.579982 -3.688315 -0.041742
C  5.315427 -0.267909 0.406458
C  6.108786 -1.082232 -0.607341
H  -0.342436 0.732839 -2.363537
H  -3.165686 0.530661 -1.305572
H  -2.390458 -0.702458 1.662511
H  -0.376311 2.549723 1.356232
H  -0.416864 -1.884412 -2.0201
H  -4.72867 2.474452 -1.136569
H  -3.480107 -2.951287 1.802824
H  -1.945974 4.473765 1.536768
H  -1.519021 -4.129334 -1.893476
H  -4.127759 4.455233 0.291684
H  -3.056473 -4.673056 0.019157
H  5.624376 0.792342 0.439745
H  5.366635 -0.681962 1.429219
H  7.179529 -1.072805 -0.333675
H  5.764406 -2.129982 -0.629051
H  6.001024 -0.657662 -1.619314
