program: Gaussian 09
title: 000157283
version: EM64L-G09RevD.01
frameworkgroup: C1[X(C11H12N2S)]
method: RPBEPBE
basis: SDD
operation: Freq
keyword: #p
keyword: freq=noraman
keyword: PBEPBE/SDD
title: #p freq=noraman PBEPBE/SDD
converged: YES YES NO NO
title: Mulliken charges:
elementType: S N N C C C C C C C C C C C H H H H H H H H H H H H
charge: 0.251188 -0.126616 -0.068415 -0.404837 -0.363895 -0.305956 -0.149833 -0.674252 0.450287 -0.402348 -0.401999 -0.234003 -0.227950 -0.242990 0.229384 0.237440 0.251718 0.237195 0.223206 0.261736 0.285925 0.227141 0.273738 0.223174 0.224380 0.226583
chargesum: 0.00000
title: Mulliken charges with hydrogens summed into heavy atoms:
elementType: S N N C C C C C C C C C C C
charge: 0.251188 -0.126616 -0.068415 0.061987 -0.112177 0.154445 -0.149833 -0.126592 0.450287 -0.175207 -0.128262 -0.010830 -0.003570 -0.016407
polarizability: 2.02236606e+02 2.71589883e+00 1.33118830e+02 -1.89963079e+00 -6.21327807e+00 9.02550378e+01
1716.lowfreq: -16.2752 -7.2050 -2.8710 -0.0007 0.0005 0.0020 13.4765 46.0325 85.5741
frequency: 11.5808 46.0305 85.5658 134.8381 184.9812 218.8671 248.1182 265.3047 275.0182 401.5668 411.8082 470.8602 501.1941 526.0270 566.5803 612.0961 616.5647 641.7943 658.3243 706.1226 740.5413 759.6091 803.0844 856.5679 864.8508 913.2654 917.3720 945.5729 978.8800 980.0092 989.8768 997.3149 998.0212 1023.6783 1026.2936 1033.5562 1080.7905 1140.9104 1149.4311 1168.4109 1170.5304 1182.7224 1197.4024 1211.6044 1218.1506 1257.1360 1278.7061 1290.8613 1302.7800 1330.4236 1367.4944 1382.8368 1436.8827 1448.8243 1473.5890 1482.9331 1487.3384 1569.0510 1594.5176 1615.4441 2921.2839 2941.0295 2969.0294 3041.8243 3060.1384 3068.4103 3108.4784 3124.4301 3137.9535 3140.0384 3154.0219 3165.1995
redmass: 3.9635 4.5619 5.0026 3.5006 2.3144 4.4169 3.0217 5.2517 5.9461 2.8519 4.1038 7.5256 5.6083 3.9698 4.0220 6.3363 6.4219 5.8102 3.1300 1.8380 3.8741 1.8460 4.2065 1.2487 1.8095 3.0346 1.5204 3.5699 1.8895 1.5863 5.6631 2.5480 1.3536 2.2297 1.9750 1.9643 1.5709 2.2806 1.2115 1.4772 1.0641 1.1090 1.5147 2.2399 2.0119 1.2380 1.3106 1.6552 1.4721 1.3878 1.6360 7.9268 2.2014 1.0959 1.0890 2.3646 1.1216 8.1073 6.3305 6.1397 1.0694 1.0684 1.0828 1.0876 1.0627 1.0965 1.0876 1.0864 1.0924 1.1099 1.0958 1.0996
irintensity: 1.7337 1.0145 2.4313 0.8163 3.9960 5.6204 3.6728 1.8627 1.9666 0.1103 0.8036 4.1682 4.8794 10.5009 8.1408 2.5316 0.8798 11.2516 4.5450 47.6820 6.5270 47.9735 4.9367 0.0810 8.2680 6.2636 5.7450 8.1027 4.7911 1.5738 0.2083 10.6482 0.5570 6.8568 13.8052 2.8650 7.8303 48.7372 2.6231 27.6479 0.4389 5.3261 29.4502 18.7545 41.2029 30.1729 1.9207 36.6131 6.2688 14.5522 9.7847 5.2900 13.2676 8.1582 3.2705 18.5441 22.0737 340.3893 21.7155 6.3185 73.1029 52.5732 29.8650 9.9620 41.3421 26.6349 11.9549 0.8563 30.9544 11.0100 28.3284 17.7813
temp: 298.150 k
press: 1.00000 atm
elementType: 16 7 7 6 6 6 6 6 6 6 6 6 6 6 1 1 1 1 1 1 1 1 1 1 1 1
symmnumber: 1
zpe: 544793.4 jmol-1
zpe.correction: 0.207501 hartree
zpe.thermalcorrener: 0.219311 hartree
zpe.thermalcorrenthalpy: 0.220255 hartree
zpe.thermalcorrgfe: 0.167260 hartree
zpe.sumelectzpe: -932.899204 hartree
zpe.sumelectthermal: -932.887394 hartree
zpe.sumelectthermalent: -932.886450 hartree
zpe.sumelectthermalfe: -932.939445 hartree
dipole: -1.5065 3.7948 2.5468
dipole: 4.8120
quadrupole: -75.9863 -87.3965 -92.1203
quadrupole: -4.9168 -4.2394 -4.1383
quadrupole: 9.1814 -2.2288 -6.9526 -4.9168 -4.2394 -4.1383
hfenergy: -933.1067052 hartree
pointgroup: C01 [X(C11H12N2S1)]
dipole: 0.6535173 -1.4411345 1.039345 debye
dipolederiv: -0.5606117 -0.0854515 -0.0658487 -0.1984442 -0.0810226 -0.0206583 -0.1173506 -0.0149516 -0.0726343 -0.9012575 -0.0477988 -0.0926456 0.3441562 -0.8229175 0.2581055 -0.1935381 0.0119676 -0.386521 -1.3991991 0.0205134 -0.2447044 0.062173 -0.4102637 0.1105421 -0.1839068 0.0730825 -0.4351962 0.2038752 0.2171851 -0.1791098 0.038701 0.2066715 0.1184563 -0.0908912 0.1201284 0.2001993 0.5422949 0.0311385 0.0176188 0.2667559 0.1896409 0.0403654 -0.0695748 0.0434069 0.2985076 0.3401853 -0.1129722 0.1275521 -0.1572163 0.1390166 0.0869291 0.1584886 0.0168962 0.4835013 1.6281589 0.1508974 0.3557355 -0.0802425 0.7487066 -0.3193912 0.499695 -0.1607717 0.2048406 0.1187297 -0.1568987 0.063636 -0.2477873 0.1645324 -0.0277878 0.0599812 -0.0083595 0.1457408 0.2839944 -0.0480457 -0.0386286 -0.1647204 -0.0363975 0.011526 -0.0879187 0.025877 -0.0541186 -0.1949233 -0.0049859 -0.042076 0.0261329 0.0392502 0.0966472 0.0018596 0.0822173 -0.111823 -0.1470725 0.0823962 -0.0031975 0.1512226 -0.0365526 0.0208863 0.0072713 -0.0075092 -0.1138824 0.0191139 0.0832825 -0.0189442 0.0941807 0.0276105 0.0480239 -0.008953 0.0574407 -0.1272183 -0.0294857 -0.0303505 -0.05196 -0.0525765 0.0971515 0.1035215 -0.0481044 0.1064356 -0.0967111 0.0263524 -0.0099731 -0.0791493 -0.0220226 -0.087391 0.0411924 -0.0664818 0.0377784 -0.132315 0.0137817 -0.0664998 0.0486206 -0.0317352 0.0440987 -0.0503711 0.1250331 0.028312 -0.1582153 0.0369624 -0.0255596 0.0023697 -0.0486265 -0.133486 -0.0274708 0.0180807 -0.0503857 0.0644199 -0.0632213 -0.0142368 -0.0137183 -0.1131257 -0.0119362 -0.106262 -0.0082852 -0.0676376 -0.0967616 0.0487248 0.0285675 -0.0092317 0.1121364 -0.1218398 0.0549578 -0.0338818 0.0168906 0.0503867 -0.0324052 0.0271017 0.0872876 0.0031036 0.0570766 -0.0895741 -0.0583779 0.0236113 -0.2181572 -0.0178917 -0.0168643 -0.0817669 -0.0039603 0.0641714 -0.0173586 -0.1318736 -0.0193927 -0.0094613 -0.0017126 0.0512811 0.049571 0.1357338 -0.0248331 -0.0218494 0.0783079 -0.0224231 -0.0126606 0.0911411 0.0642623 0.053721 0.0477835 -0.0596452 -0.0974926 0.0420364 -0.098976 0.0847008 0.1056497 -0.0897998 -0.0027601 -0.1197609 0.0448567 -0.0344509 -0.0428437 -0.0156086 0.1301624 -0.0454411 -0.1109182 -0.0024752 -0.1300979 -0.0151921 -0.0404896 0.0052511 -0.0419056 0.1386322 0.056819 0.0357985 0.0364867 0.0608672 -0.0739153 -0.1017783 0.0541781 -0.0996665 0.1014829 -0.1225616 0.0279306 0.0836175 0.0273694 0.0926088 -0.0362188 0.0917988 -0.0364566 0.1231013 unknown
polarizability: 201.8680911|5.6935299|133.7614731|1.7803276|5.2356975|89.9809104 unknown
InChI: InChI=1S/C11H12N2S/c1-2-4-9(5-3-1)10-8-13-6-7-14-11(13)12-10/h1-5,10H,6-8H2
charge 0 multiplicity 1
26 atoms
S  3.490102 1.518941 -0.189925
N  2.145381 -0.798618 0.045917
N  0.825704 0.871887 -0.918812
C  0.767755 -1.335098 0.184014
C  -0.027135 -0.374879 -0.79843
C  3.2211 -0.95301 1.03728
C  1.987861 0.526337 -0.432073
C  4.355638 -0.022722 0.546911
C  -1.449098 -0.091768 -0.333829
C  -2.446723 -1.090328 -0.473498
C  -1.790476 1.1431 0.268221
C  -3.760134 -0.865612 -0.0046
C  -3.10556 1.370944 0.733795
C  -4.093437 0.367343 0.60388
H  0.400139 -1.22885 1.228398
H  0.703003 -2.393036 -0.118439
H  -0.062555 -0.848123 -1.801575
H  3.578705 -1.997309 1.075644
H  2.881991 -0.65811 2.056812
H  5.00909 0.310302 1.366142
H  4.944919 -0.48868 -0.256728
H  -2.199238 -2.044286 -0.957759
H  -1.022087 1.919335 0.340551
H  -4.522543 -1.644551 -0.120124
H  -3.361237 2.333445 1.191795
H  -5.112963 0.545847 0.964132
