program: Gaussian 09
title: 000157281
version: EM64L-G09RevD.01
frameworkgroup: C1[X(C11H20N2O2)]
method: RPBEPBE
basis: SDD
operation: Freq
keyword: #p
keyword: freq=noraman
keyword: PBEPBE/SDD
title: #p freq=noraman PBEPBE/SDD
converged: YES YES NO NO
title: Mulliken charges:
elementType: O O N N C C C C C C C C C C C H H H H H H H H H H H H H H H H H H H H
charge: -0.437879 -0.325689 -0.400476 -0.415223 0.416981 -0.506578 -0.596714 -0.520423 -0.435341 -0.039790 -0.063968 0.332490 -0.617420 -0.619673 -0.604180 0.216509 0.280286 0.204975 0.244466 0.200677 0.224498 0.248575 0.189890 0.276642 0.225791 0.288436 0.347877 0.222056 0.221109 0.212419 0.219660 0.286521 0.221642 0.221031 0.280824
chargesum: 0.00000
title: Mulliken charges with hydrogens summed into heavy atoms:
elementType: O O N N C C C C C C C C C C C
charge: -0.090003 -0.325689 -0.123834 -0.128702 0.416981 -0.009783 -0.147273 -0.095248 0.003124 0.186001 0.224467 0.332490 -0.174254 -0.187594 0.119317
polarizability: 1.73456969e+02 -8.05688349e+00 1.52559064e+02 6.11629267e-01 4.64891065e+00 1.01185914e+02
1716.lowfreq: -14.3609 -11.0453 -0.0008 -0.0005 -0.0005 5.5641 30.5789 45.4040 58.7560
frequency: 30.2788 45.3953 58.7495 73.2574 86.8428 93.5247 99.1332 111.0736 133.3004 140.8746 156.0805 186.6931 236.7606 247.1749 273.6682 285.1550 315.4516 320.3937 335.9784 367.1740 396.7300 422.7953 439.6907 488.8131 518.5466 532.4977 583.9855 600.0240 657.9961 685.0521 708.8818 795.0115 852.4805 857.0122 862.0978 901.4928 935.5463 946.1964 947.5965 953.7803 969.1743 983.2401 1006.2164 1025.8919 1046.3477 1053.8158 1077.6167 1118.7696 1126.8191 1132.6558 1162.1831 1170.8164 1178.5205 1196.9753 1221.3781 1231.0183 1258.2698 1273.6972 1284.5220 1307.5065 1315.1972 1324.0161 1347.6852 1359.6789 1383.0249 1420.8058 1423.9134 1428.0350 1451.0843 1454.9136 1459.9574 1469.6065 1472.1977 1486.6026 1488.0064 1527.7253 1633.2606 1647.1557 1653.8702 2952.2199 2958.6431 2964.6495 2971.0045 2972.3002 3031.7189 3037.1984 3046.9780 3065.7361 3072.8501 3075.3131 3078.1835 3086.5650 3092.1566 3107.8521 3187.5270 3190.7142 3536.6828 3546.5902 3560.2887
redmass: 4.1112 3.6506 3.6473 3.5944 2.9737 2.5673 3.3366 1.3962 2.7778 2.7706 2.9389 2.8288 2.7133 3.0827 2.7696 2.4422 1.6836 2.6982 3.1131 2.5724 1.9780 1.2457 1.7829 1.5891 1.2421 3.6560 2.6025 1.5788 2.5284 2.1705 9.9506 2.8943 2.1578 2.1821 1.7773 2.7983 1.7101 1.3647 1.3539 1.7459 3.3404 2.0567 1.2035 1.8573 1.3392 3.1613 1.5493 1.6342 1.2760 1.5960 3.3208 3.5023 2.4008 1.5090 1.2664 1.6494 1.2666 1.3460 1.2642 1.2407 1.4972 1.3338 1.2517 1.3320 1.1961 1.1714 1.1576 1.1800 1.2900 1.1877 1.0915 1.1423 1.1108 1.2199 1.0645 1.7851 4.8136 4.5282 4.4177 1.0673 1.0642 1.0621 1.0453 1.0575 1.0951 1.0961 1.1028 1.0922 1.0945 1.0688 1.0604 1.0843 1.0951 1.0970 1.1141 1.1138 1.0658 1.0772 1.0769
irintensity: 5.7669 0.1518 6.4295 3.8540 3.3417 0.6892 0.4713 2.1987 6.1621 8.0494 0.1674 1.1228 4.7739 3.9583 1.0508 1.1149 26.7271 1.2334 2.9291 14.2918 17.2715 79.4576 26.2224 20.2231 245.5996 8.1631 21.5247 29.1183 1.0959 3.4299 9.9977 13.5295 21.0661 9.2009 13.5178 2.6716 25.9719 63.9077 77.3427 6.8942 80.8011 4.1665 14.2419 10.5520 15.5515 2.2342 3.1412 20.6779 0.3028 49.2480 1.2687 6.1775 4.4223 7.0355 4.0651 217.1518 90.3187 12.3509 1.4656 6.0321 2.9955 3.5862 24.3755 2.8800 10.3093 36.6374 1.0611 5.8988 18.6832 11.4192 32.0694 84.2198 47.7552 80.7535 28.0675 366.1463 164.2002 18.3838 17.4966 42.9098 6.0216 52.1869 142.2147 41.0693 1.1237 31.0199 45.1860 0.7469 14.4316 25.9674 5.5431 6.6803 13.1182 1.6551 24.4721 24.5094 8.8708 6.9437 12.5404
temp: 298.150 k
press: 1.00000 atm
elementType: 8 8 7 7 6 6 6 6 6 6 6 6 6 6 6 1 1 1 1 1 1 1 1 1 1 1 1 1 1 1 1 1 1 1 1
symmnumber: 1
zpe: 782301.1 jmol-1
zpe.correction: 0.297963 hartree
zpe.thermalcorrener: 0.316316 hartree
zpe.thermalcorrenthalpy: 0.317261 hartree
zpe.thermalcorrgfe: 0.250971 hartree
zpe.sumelectzpe: -689.878708 hartree
zpe.sumelectthermal: -689.860355 hartree
zpe.sumelectthermalent: -689.859411 hartree
zpe.sumelectthermalfe: -689.925701 hartree
dipole: -0.6798 -5.7743 -1.4686
dipole: 5.9968
quadrupole: -89.9448 -90.6133 -93.2963
quadrupole: 2.1065 5.7176 0.4467
quadrupole: 1.3400 0.6715 -2.0115 2.1065 5.7176 0.4467
hfenergy: -690.1766712 hartree
pointgroup: C01 [X(C11H20N2O2)]
dipole: -0.3062314 -2.2574214 -0.6137222 debye
polarizability: 173.0781336|-8.5730498|152.7671084|1.6234481|5.2297275|101.3567052 unknown
InChI: InChI=1S/C11H20N2O2/c1-4-6-11(9-14,7-5-2)8-13-10(15)12-3/h4-5,12-14H,1-2,6-9H2,3H3
charge 0 multiplicity 1
35 atoms
O  3.419234 0.914139 0.246989
O  -2.758491 0.665373 0.81095
N  -1.246864 -1.03275 0.235903
N  -3.495924 -1.168261 -0.445457
C  1.051718 0.068259 0.017158
C  -0.108431 -0.427323 0.938497
C  1.632825 -1.110638 -0.837666
C  0.574165 1.175474 -0.983202
C  2.15767 0.642481 0.950601
C  2.368496 -2.177228 -0.051465
C  -0.119461 2.369164 -0.354211
C  -2.516402 -0.443785 0.236074
C  3.63716 -2.592318 -0.306301
C  0.397767 3.624413 -0.335212
C  -4.877712 -0.687308 -0.529242
H  0.293723 -1.153364 1.6748
H  -0.516296 0.42194 1.513589
H  0.789233 -1.572985 -1.392991
H  2.30738 -0.691752 -1.607754
H  -0.112393 0.700396 -1.715162
H  1.468189 1.518804 -1.53824
H  1.837528 1.619888 1.348259
H  2.332717 -0.050268 1.801943
H  -1.121007 -1.955417 -0.181279
H  1.823545 -2.646681 0.782792
H  -1.107181 2.183456 0.094306
H  3.885636 0.049125 0.11275
H  4.120904 -3.373552 0.290587
H  4.221055 -2.176964 -1.139052
H  -0.147105 4.460913 0.118383
H  1.379973 3.850152 -0.771069
H  -3.253611 -2.042838 -0.911431
H  -5.182579 -0.503061 -1.576779
H  -5.585787 -1.40198 -0.068665
H  -4.925174 0.264091 0.024297
