program: Gaussian 09
title: 000157244
version: EM64L-G09RevD.01
frameworkgroup: C1[X(C19H16)]
method: RPBEPBE
basis: SDD
operation: Freq
keyword: #p
keyword: freq=noraman
keyword: PBEPBE/SDD
title: #p freq=noraman PBEPBE/SDD
converged: YES YES NO YES
title: Mulliken charges:
elementType: C C C C C C C C C C C C C C C C C C C H H H H H H H H H H H H H H H H
charge: -0.001965 0.276653 0.412099 -0.018569 -0.220574 0.488506 0.497620 0.472654 -0.469257 -0.453022 -0.534104 -0.517125 -0.486907 -0.489686 -0.698051 -0.698046 -0.473829 -0.468020 -0.244634 0.207330 0.229296 0.220539 0.238037 0.233631 0.238707 0.236386 0.212708 0.214224 0.229942 0.229941 0.214223 0.212715 0.242388 0.240262 0.225924
chargesum: 0.00000
title: Mulliken charges with hydrogens summed into heavy atoms:
elementType: C C C C C C C C C C C C C C C C C C C
charge: -0.001965 0.276653 0.412099 -0.018569 -0.013244 0.488506 0.497620 0.472654 -0.248718 -0.223726 -0.296067 -0.283494 -0.248199 -0.253300 -0.041177 -0.041166 -0.231441 -0.227758 -0.018710
polarizability: 3.39752358e+02 -1.89217562e+01 2.31142803e+02 2.51590816e-03 1.67936940e-03 9.69234768e+01
1716.lowfreq: -13.0707 -12.4787 -5.5884 -0.0009 -0.0004 0.0002 18.4319 55.1458 100.2212
frequency: 18.3504 55.0099 100.2156 163.7684 166.9947 210.0297 215.1059 234.7662 237.8055 251.2615 265.3010 358.6986 363.4048 395.3938 420.0196 439.9060 472.8624 489.8860 504.3027 507.9442 517.1093 551.4341 551.9158 599.6489 636.3970 674.9738 688.3706 697.7006 741.3819 752.0289 767.7730 807.6581 814.4477 831.3959 843.3015 859.2833 875.0712 897.6398 912.7370 916.6555 952.7050 963.5777 968.7560 974.1300 983.6378 989.5810 1038.5464 1053.3773 1090.5965 1109.1047 1111.7738 1151.7673 1163.5682 1180.8604 1185.5616 1193.0462 1229.0671 1249.0619 1253.3657 1258.8530 1302.5754 1314.0824 1332.9921 1377.8983 1384.4501 1387.5825 1397.3502 1406.3546 1424.4489 1428.9523 1437.0129 1463.8829 1466.2781 1468.3038 1478.9661 1484.8057 1494.1665 1513.6684 1549.4516 1593.2204 1604.8128 1612.0182 1635.7060 2974.8178 2977.3100 3024.0802 3067.5192 3075.6101 3077.9073 3083.4595 3117.4842 3118.7851 3121.4157 3123.3408 3131.3254 3141.4811 3143.8599 3155.4976 3157.7458
redmass: 2.7506 3.6739 4.3771 3.3927 3.2832 1.3892 2.7761 1.2064 2.6359 2.3122 4.3362 3.7451 3.9936 3.9857 4.7585 3.4240 4.7768 4.2497 3.6471 5.5098 3.5411 5.2558 3.0270 4.6544 3.7011 3.5202 7.0259 3.4891 2.3024 5.4726 1.2722 4.7500 1.3532 4.7301 2.1647 3.1240 1.7834 2.8263 1.3924 1.2259 1.4827 1.3374 4.6623 1.3491 1.3942 1.4135 3.6418 1.5497 1.9169 2.6229 2.3863 1.4397 1.4714 1.5369 1.4023 1.2771 1.8937 1.5511 2.3053 2.3596 1.3113 1.9352 2.8118 1.1913 2.7275 2.3732 1.2586 2.6232 3.7445 5.2810 2.1947 4.7523 1.0449 1.0508 1.0560 1.0970 4.7160 3.6095 4.8559 6.5227 6.9319 6.5295 7.4986 1.0348 1.0352 1.0836 1.1000 1.0990 1.1005 1.0992 1.0863 1.0861 1.0861 1.0874 1.0917 1.0970 1.0975 1.0988 1.0948
irintensity: 0.0486 0.2681 0.1634 0.3941 0.4317 1.9092 9.3600 0.0438 0.0245 0.0062 0.0002 0.0055 1.6622 0.2282 0.0391 0.0000 0.2610 0.6271 0.3961 3.1173 1.2008 2.0337 1.1361 1.5473 9.9876 0.1392 0.0101 5.3886 21.9472 0.0147 16.0675 6.7797 1.6488 0.5478 2.5298 0.9870 143.8468 4.8567 2.4756 0.5830 0.4220 0.4087 1.6619 0.3484 3.1539 1.3888 3.9776 39.7897 8.7156 2.3079 1.7607 4.8438 0.3839 0.7443 4.6313 19.6762 2.0439 6.1712 3.5060 0.9610 1.0501 4.6307 4.3314 16.4424 8.4375 0.1327 8.9681 2.9341 2.4849 0.1416 5.8604 6.9149 2.1450 3.9713 16.8874 10.5031 3.7199 11.6023 0.9812 6.5764 1.1866 7.2236 1.8362 31.0005 54.6743 3.6637 0.0038 101.7508 22.0418 41.1513 7.3214 5.9217 0.8467 3.1709 16.3575 24.8779 50.9992 46.2673 26.7970
temp: 298.150 k
press: 1.00000 atm
elementType: 6 6 6 6 6 6 6 6 6 6 6 6 6 6 6 6 6 6 6 1 1 1 1 1 1 1 1 1 1 1 1 1 1 1 1
symmnumber: 1
zpe: 753405.2 jmol-1
zpe.correction: 0.286957 hartree
zpe.thermalcorrener: 0.301783 hartree
zpe.thermalcorrenthalpy: 0.302728 hartree
zpe.thermalcorrgfe: 0.244974 hartree
zpe.sumelectzpe: -732.377813 hartree
zpe.sumelectthermal: -732.362987 hartree
zpe.sumelectthermalent: -732.362042 hartree
zpe.sumelectthermalfe: -732.419796 hartree
dipole: -0.6859 -0.1873 0.0000
dipole: 0.7110
quadrupole: -96.5410 -98.0015 -118.8808
quadrupole: 0.6635 0.0003 0.0004
quadrupole: 7.9334 6.4729 -14.4063 0.6635 0.0003 0.0004
hfenergy: -732.66477 hartree
pointgroup: C01 [X(C19H16)]
dipole: -0.2682436 -0.0793879 0.0000088 debye
polarizability: 340.5040895|-16.6079061|230.3910719|0.0024798|0.0017322|96.9234768 unknown
InChI: InChI=1S/C19H16/c1-12(2)16-10-8-15-7-6-13-4-3-5-14-9-11-17(16)19(15)18(13)14/h3-12H,1-2H3
charge 0 multiplicity 1
35 atoms
C  0.112456 0.3803 -0.000009
C  -1.014659 -0.533808 -0.000046
C  -2.351353 -0.010061 -0.00006
C  1.463095 -0.119996 0.0000
C  -3.602853 -0.897116 -0.000084
C  -0.108415 1.805831 0.00002
C  1.712888 -1.540628 -0.000022
C  2.581942 0.794839 0.000032
C  -0.718873 -1.955316 -0.000063
C  -2.526964 1.397965 -0.000023
C  -1.442083 2.290531 0.000015
C  0.578119 -2.434649 -0.000051
C  1.027103 2.702021 0.000053
C  2.321767 2.218023 0.000059
C  -4.45588 -0.675466 -1.279786
C  -4.455684 -0.675754 1.2798
C  3.051213 -2.018398 -0.000014
C  3.905439 0.275631 0.000039
C  4.1357 -1.116233 0.000017
H  -3.296285 -1.957964 -0.000233
H  -3.545172 1.803534 -0.000027
H  -1.543516 -2.673762 -0.000082
H  -1.618646 3.372664 0.00004
H  0.765842 -3.515107 -0.000064
H  0.836053 3.781745 0.000073
H  3.175637 2.90582 0.000083
H  -4.841782 0.359379 -1.330263
H  -5.32476 -1.359783 -1.288164
H  -3.860333 -0.858333 -2.192184
H  -3.860003 -0.85885 2.192065
H  -5.324581 -1.36005 1.28815
H  -4.841545 0.359091 1.330575
H  3.232568 -3.099566 -0.000031
H  4.75129 0.973186 0.000064
H  5.162469 -1.498122 0.000024
