program: Gaussian 09
title: 000157224
version: EM64L-G09RevD.01
frameworkgroup: C1[X(C5H12NO2PS)]
method: RPBEPBE
basis: SDD
operation: Freq
keyword: #p
keyword: freq=noraman
keyword: PBEPBE/SDD
title: #p freq=noraman PBEPBE/SDD
converged: YES YES NO NO
title: Mulliken charges:
elementType: S P O O N C C C C C H H H H H H H H H H H H
charge: -0.241019 0.926757 -0.447351 -0.454748 -0.802077 0.045221 -0.307743 -0.381266 -0.687410 -0.479511 0.245095 0.218632 0.231008 0.219675 0.203500 0.343326 0.205086 0.218644 0.229914 0.235015 0.243279 0.235972
chargesum: 0.00000
title: Mulliken charges with hydrogens summed into heavy atoms:
elementType: S P O O N C C C C C
charge: -0.241019 0.926757 -0.447351 -0.454748 -0.458751 0.290317 0.141897 0.041909 -0.033766 0.234756
polarizability: 1.33806003e+02 1.06002980e+01 1.03756238e+02 -7.09578014e+00 -2.24639017e+00 8.34558001e+01
1716.lowfreq: -13.7762 -0.0019 -0.0007 0.0023 2.3992 22.3663 43.3112 63.6572 78.2590
frequency: 43.1203 63.2659 78.2484 112.9448 128.9196 155.2918 162.6492 191.7607 235.6851 250.6632 294.9844 324.2338 373.5967 404.6511 418.2281 468.0048 561.8109 594.3210 652.2997 674.6673 768.4133 853.5427 870.5322 929.8110 950.6992 966.7086 1004.9208 1018.9697 1085.4405 1112.8659 1131.6749 1133.2274 1141.5180 1185.2123 1265.6330 1278.9947 1302.2004 1333.7833 1344.2524 1375.2392 1397.0667 1420.8494 1457.5009 1459.6408 1465.2280 1472.7074 1478.1985 1486.3455 2946.0920 2977.2354 2977.6300 2981.7943 3001.1990 3039.4923 3071.6910 3080.0727 3082.7713 3098.5518 3118.4858 3631.2554
redmass: 3.8581 3.3856 2.5809 1.6475 1.5972 3.2942 2.8254 2.7119 1.4076 5.2331 6.3699 3.8033 2.9544 1.7047 4.4943 2.7246 3.0897 11.2118 9.0629 11.3461 1.3755 3.1740 2.4764 7.4171 1.5926 10.0702 1.8608 2.5210 2.2879 1.2439 1.8640 1.3226 2.5931 1.2411 1.1497 1.2394 1.2560 1.2544 1.2765 1.5918 1.2061 1.1172 1.0782 1.0512 1.0870 1.0517 1.0570 1.0436 1.0843 1.0303 1.0360 1.0612 1.0626 1.0997 1.1004 1.1041 1.0994 1.1040 1.1033 1.0781
irintensity: 2.8726 4.9322 0.8925 0.6653 1.3405 2.3469 12.8359 5.9519 1.3785 7.4288 3.2053 4.6279 20.9507 47.4644 12.6128 30.1957 2.4909 32.3446 171.1902 164.5534 13.2837 54.4792 22.9474 173.6666 2.5660 141.7486 7.4516 80.1575 1.4500 0.5191 7.9811 0.5315 28.3875 1.8049 5.3477 24.4237 79.6298 2.5123 2.5282 12.9278 12.8414 6.1786 2.8690 13.1158 6.4408 15.0731 12.1663 15.2189 42.9772 63.3409 27.1055 15.5872 62.6305 5.9587 63.4674 25.1483 39.4232 25.9879 17.7129 42.1017
temp: 298.150 k
press: 1.00000 atm
elementType: 16 15 8 8 7 6 6 6 6 6 1 1 1 1 1 1 1 1 1 1 1 1
symmnumber: 1
zpe: 459885.2 jmol-1
zpe.correction: 0.175161 hartree
zpe.thermalcorrener: 0.187903 hartree
zpe.thermalcorrenthalpy: 0.188847 hartree
zpe.thermalcorrgfe: 0.135328 hartree
zpe.sumelectzpe: -1141.383133 hartree
zpe.sumelectthermal: -1141.370391 hartree
zpe.sumelectthermalent: -1141.369446 hartree
zpe.sumelectthermalfe: -1141.422966 hartree
dipole: -3.8702 -2.0703 -0.9354
dipole: 4.4877
quadrupole: -66.1965 -80.3941 -75.7193
quadrupole: -6.7945 -2.8106 -0.5902
quadrupole: 7.9068 -6.2908 -1.6160 -6.7945 -2.8106 -0.5902
hfenergy: -1141.5582937 hartree
pointgroup: C01 [X(C5H12N1O2P1S1)]
dipole: -1.5485907 0.3981021 -0.7488448 debye
dipolederiv: -0.5857363 -0.0158523 -0.1846984 -0.0656987 -0.3853721 0.0170965 -0.1968531 0.0469413 -0.650383 2.2749392 0.2701552 0.4412268 0.6468226 1.4363002 -0.1501411 0.3465464 -0.1459935 1.7337979 -1.0433034 -0.3044969 -0.208263 -0.3100753 -0.7421121 -0.125701 -0.2145823 -0.1874066 -0.5455557 -1.0913415 -0.3071978 0.1712503 -0.4387856 -0.7100096 0.290829 0.2809947 0.2696322 -0.7816811 -1.2096335 -0.0585936 -0.1178466 -0.2135759 -0.6319841 -0.0076953 -0.2469939 0.0612268 -0.7572264 0.254187 0.0937603 0.1207769 0.3756872 0.1787512 0.0226182 0.4291322 0.0158566 0.4638519 0.6405498 0.3294552 0.1608552 0.0742331 0.3108702 0.0085345 -0.0860728 -0.0885447 0.2173186 0.0690551 -0.0109477 0.0138754 0.0015703 0.0883457 0.0163805 -0.0546009 -0.0052972 0.106232 -0.0236162 0.0416568 0.0260227 0.0209801 0.0041783 -0.0165863 0.0734265 -0.0117925 0.0893714 0.6349637 0.2683232 -0.3456538 0.0248515 0.2505097 -0.0219497 -0.0420606 0.0329266 0.2403918 -0.0352272 -0.0073072 -0.0480177 -0.0177353 -0.0324322 0.0870287 -0.1233399 0.0560718 -0.1538488 -0.0484661 -0.095132 0.0086031 -0.0626652 -0.052012 0.0578715 0.0617707 0.1498846 -0.0193523 0.0034008 -0.0704396 -0.0781126 -0.052659 0.0437588 -0.061382 -0.0502645 -0.0943407 -0.0715123 0.0533652 0.0595826 -0.0365417 0.0384844 -0.0089098 0.0913189 0.0171441 0.1103767 -0.0704147 -0.0352363 -0.0504979 -0.0464773 -0.063168 -0.0336518 -0.1044271 -0.059143 -0.1272218 -0.0250542 0.2062736 0.0395792 -0.003232 0.0246792 0.2181331 -0.0842295 -0.1167429 -0.0815321 0.2470247 0.0525837 -0.074521 -0.1013132 -0.0397146 -0.0286374 -0.100384 -0.0823172 -0.1155897 -0.0361185 0.1024261 0.008382 0.0124533 0.0389157 0.0000629 0.0852015 -0.0409943 0.1247809 -0.0953517 -0.1819889 -0.0228372 0.0732467 -0.0497942 0.0707712 0.0203255 0.0816277 0.0094539 0.0799487 -0.0607533 -0.0153078 0.1082047 0.0816922 -0.0112271 -0.1166875 0.0992279 -0.0728915 -0.0064904 0.0013697 -0.0387382 -0.0053116 0.0370846 0.1294877 -0.0042049 -0.1328151 -0.0530555 -0.0318171 0.0221887 -0.0390253 0.0389528 -0.0511291 -0.0948207 0.0961835 0.0569101 0.1065146 0.0668692 unknown
polarizability: 129.158577|10.437206|86.966075|15.6576934|-2.6403353|104.8933889 unknown
InChI: InChI=1S/C5H12NO2PS/c1-3-5-4-8-9(10,6-5)7-2/h5-6H,3-4H2,1-2H3
charge 0 multiplicity 1
22 atoms
S  2.199854 0.192963 2.168275
P  1.020105 0.39033 0.490254
O  0.774749 -1.009466 -0.561791
O  1.565717 1.609134 -0.634026
N  -0.6697 0.678092 0.615057
C  -1.502753 -0.061472 -0.361229
C  -0.672174 -1.348325 -0.628876
C  -2.904915 -0.38136 0.195802
C  -3.781276 0.870155 0.419019
C  3.011308 1.887972 -0.761888
H  -1.604684 0.521476 -1.302447
H  -0.889276 -2.114137 0.140378
H  -0.843052 -1.755135 -1.638154
H  -2.78918 -0.941714 1.143431
H  -3.410271 -1.05684 -0.523711
H  -1.054039 1.439056 1.169297
H  -3.359996 1.535003 1.19654
H  -3.882931 1.458976 -0.511679
H  -4.795095 0.585045 0.751521
H  3.484026 1.149665 -1.433266
H  3.504567 1.86913 0.227924
H  3.070116 2.895853 -1.200829
