program: Gaussian 09
title: 000157214
version: EM64L-G09RevD.01
frameworkgroup: C1[X(C27H22N2O3)]
method: RPBEPBE
basis: SDD
operation: Freq
keyword: #p
keyword: freq=noraman
keyword: PBEPBE/SDD
title: #p freq=noraman PBEPBE/SDD
converged: YES YES NO NO
title: Mulliken charges:
elementType: O O O N N C C C C C C C C C C C C C C C C C C C C C C C C C C C H H H H H H H H H H H H H H H H H H H H H H
charge: -0.300959 -0.275959 -0.311225 -0.401854 0.002482 -0.200735 0.384874 0.180988 0.393915 -0.729073 -0.423125 -0.376445 -0.459013 -0.259324 -0.433299 -0.269555 -0.242428 0.284851 -0.184819 0.527079 -0.546610 -0.406057 0.336524 -0.192400 -0.395755 -0.194789 0.338470 -0.341394 -0.385279 -0.187216 -0.195303 -0.264776 0.249938 0.251985 0.237868 0.219592 0.247580 0.330859 0.235869 0.244837 0.233427 0.242374 0.229859 0.231823 0.291833 0.307496 0.253557 0.233221 0.261869 0.263697 0.256443 0.244761 0.228908 0.230414
chargesum: 0.00000
title: Mulliken charges with hydrogens summed into heavy atoms:
elementType: O O O N N C C C C C C C C C C C C C C C C C C C C C C C C C C C
charge: -0.300959 -0.275959 -0.311225 -0.070996 0.002482 0.049203 0.384874 0.180988 0.393915 -0.019629 -0.175545 -0.140576 -0.214177 -0.025898 -0.190925 -0.039695 -0.010605 0.284851 0.107014 0.527079 -0.239114 -0.152500 0.336524 0.040821 -0.133886 -0.194789 0.338470 -0.077698 -0.128836 0.057544 0.033605 -0.034361
polarizability: 3.73119976e+02 -4.98336756e+01 3.17318556e+02 6.17978759e+01 6.19792963e+00 2.39127176e+02
1716.lowfreq: -17.0563 -4.8141 -3.2126 -0.0005 -0.0003 0.0003 8.3947 11.8602 22.3917
frequency: -9.4032 11.3402 22.3637 27.5962 31.9641 39.0609 47.5475 61.0285 75.5163 91.7512 98.6205 102.6449 136.8545 162.4115 175.0002 179.6704 190.6765 214.3494 223.0749 232.5186 243.4082 266.0629 297.3176 299.3230 314.8628 339.1992 374.1524 377.1368 393.5938 410.5976 421.2309 439.9877 460.0258 471.3452 473.5491 478.6793 495.9474 523.0821 544.5284 552.9990 562.3709 573.3116 590.6312 610.1964 620.2202 630.8298 642.0045 651.4720 684.8807 691.2781 695.0912 701.8086 716.5718 745.1666 747.0662 768.6434 785.2739 788.4531 801.7743 814.3170 821.6295 829.8185 836.5348 861.3347 876.6893 896.7053 904.0112 909.9021 921.0341 923.7003 926.7704 955.7022 962.2452 971.3395 980.2503 986.4747 986.9757 987.2754 991.8466 994.3870 995.7513 1016.9926 1019.0716 1024.3441 1037.1771 1076.8378 1086.8485 1088.4430 1096.7872 1142.4647 1143.9233 1157.9688 1166.7865 1172.5439 1176.6785 1176.9977 1180.7577 1193.5213 1204.2482 1234.3037 1241.2557 1246.4918 1266.4223 1275.7754 1281.3576 1282.0505 1305.4681 1322.2875 1350.9232 1381.4954 1382.6273 1392.8524 1393.7865 1404.8867 1421.3158 1437.2940 1439.9864 1442.8882 1454.4989 1466.6547 1469.6084 1472.5478 1480.9760 1486.6284 1517.2323 1588.9957 1593.4215 1596.6196 1599.8067 1604.8454 1612.4540 1632.5744 1674.0777 2206.2967 2986.1773 3009.1158 3020.4429 3081.3827 3104.4542 3123.5472 3124.7899 3133.1256 3133.8074 3136.0253 3139.2102 3145.1294 3149.6436 3154.1032 3156.6329 3157.7446 3158.1137 3165.2306 3167.4720 3174.4232 3175.7011 3561.0640
redmass: 5.5561 5.3520 5.5180 5.6393 6.0912 4.7863 5.3706 6.3415 8.2671 6.7410 5.7270 4.6081 4.4736 5.6236 4.1283 5.7393 3.5947 4.4331 2.5275 3.1682 1.9355 4.8536 4.5292 4.6248 6.2715 5.9236 5.5333 3.9956 4.5536 2.9622 6.4141 3.0720 3.5363 3.7972 4.5242 3.5786 5.3082 7.2113 1.7828 2.1658 7.1851 3.3039 5.2103 6.2855 5.3707 5.3976 6.9288 3.4227 6.3522 2.8391 2.8058 3.9085 4.1879 1.8475 1.8315 1.8698 4.8144 2.1853 1.8211 1.4725 5.0204 3.7284 1.2805 4.9743 1.6856 2.3770 1.4602 1.5020 3.3091 1.4251 1.4833 4.1617 1.4314 1.3618 1.3488 5.7567 2.0641 2.1525 1.3886 1.9261 1.8918 3.1414 2.1857 2.2500 2.1005 1.5057 1.5846 2.0344 2.7158 1.9167 1.9147 1.8377 1.1783 1.1652 1.1365 1.1255 1.3405 2.0750 2.0149 1.8287 3.5221 2.1885 1.5575 1.4739 1.5825 1.3930 1.3424 1.3034 1.6558 8.2279 1.5513 7.6640 1.3260 3.2102 3.5197 2.5322 2.4419 2.4783 2.3747 1.3574 1.7678 1.3365 2.4851 1.1919 3.6090 7.5166 6.2456 6.5414 5.2669 6.3439 6.6147 6.5083 10.3309 12.5968 1.0371 1.0825 1.0836 1.0999 1.0990 1.0861 1.0857 1.0853 1.0881 1.0911 1.0872 1.0889 1.0943 1.0926 1.0932 1.0933 1.0986 1.1003 1.0962 1.0983 1.1008 1.0776
irintensity: 0.2419 0.0823 0.1955 0.0475 0.2896 0.1639 1.7357 3.7447 6.0886 1.8924 0.6796 1.3186 2.5218 1.8181 3.1595 0.3419 1.3414 1.1344 3.9493 4.5138 0.9809 9.0690 0.7206 2.8328 0.2246 6.8650 2.3650 4.6587 3.5542 0.6908 5.9441 16.6343 10.4768 0.9194 3.8254 9.7241 2.9645 4.6268 58.8088 46.2698 3.6228 5.6930 3.8238 0.8806 1.6978 1.5103 3.9633 0.8961 17.4039 16.3162 18.8159 27.5794 8.6872 1.1519 5.4829 91.6284 4.2349 63.6470 55.2617 75.5516 21.3344 1.9971 2.6334 43.0442 11.3049 5.0011 7.1594 1.4483 57.9817 1.7088 4.4708 228.7809 18.7520 1.1760 0.2630 0.8063 0.5147 2.1209 1.4484 35.5757 22.5168 50.1330 8.3160 17.3725 20.9396 15.9156 3.5262 2.5110 5.2236 7.6907 2.2240 21.6754 33.0695 29.5972 3.7488 1.7130 44.3453 101.1031 114.4569 1.6227 246.2011 118.0268 8.8049 13.4025 16.4168 14.1350 0.8200 2.2734 17.7349 5.4182 25.0166 12.1505 25.1204 0.9441 0.6936 25.3440 2.8604 31.5767 1.0853 128.9900 146.1375 184.4565 38.5359 84.2529 16.5961 0.2092 85.1216 79.6258 7.3002 27.1616 2.0927 3.1683 255.5444 2.1603 26.1188 24.4800 3.2772 24.8626 22.5206 1.3734 0.2601 2.9312 3.2155 13.0662 5.8508 5.6599 33.8544 10.2343 0.3574 18.0815 34.1206 23.9962 12.7867 10.4360 4.1679 43.2410
temp: 298.150 k
press: 1.00000 atm
elementType: 8 8 8 7 7 6 6 6 6 6 6 6 6 6 6 6 6 6 6 6 6 6 6 6 6 6 6 6 6 6 6 6 1 1 1 1 1 1 1 1 1 1 1 1 1 1 1 1 1 1 1 1 1 1
symmnumber: 1
zpe: 1100105.0 jmol-1
zpe.correction: 0.419008 hartree
zpe.thermalcorrener: 0.445898 hartree
zpe.thermalcorrenthalpy: 0.446842 hartree
zpe.thermalcorrgfe: 0.359103 hartree
zpe.sumelectzpe: -1375.027929 hartree
zpe.sumelectthermal: -1375.001039 hartree
zpe.sumelectthermalent: -1375.000095 hartree
zpe.sumelectthermalfe: -1375.087833 hartree
dipole: -5.0288 0.6811 2.2276
dipole: 5.5421
quadrupole: -186.4326 -183.0425 -180.9088
quadrupole: 14.3836 15.0702 -7.6225
quadrupole: -2.9713 0.4188 2.5525 14.3836 15.0702 -7.6225
hfenergy: -1375.4469364 hartree
pointgroup: C01 [X(C27H22N2O3)]
dipole: -2.0846331 0.2077799 0.6044933 debye
polarizability: 343.3059645|-71.8634346|321.0638321|63.1106138|10.2106844|265.1959108 unknown
InChI: InChI=1S/C27H22N2O3/c1-19(24-16-8-10-20-9-5-6-15-25(20)24)29-27(30)32-26(18-28)21-11-7-14-23(17-21)31-22-12-3-2-4-13-22/h2-17,19,26,29H,1H3
charge 0 multiplicity 1
54 atoms
O  1.814447 -2.661154 -0.731671
O  0.619957 -0.956544 -1.867407
O  2.718363 2.40542 1.608591
N  -0.451804 -2.797046 -0.873491
N  4.934302 -3.653921 -1.642787
C  -1.829493 -2.391504 -1.211014
C  -2.407936 -1.358483 -0.226845
C  -3.512558 -0.514642 -0.628656
C  -4.069796 0.419624 0.333918
C  -2.711973 -3.66293 -1.27731
C  -1.901617 -1.252699 1.073064
C  -4.087453 -0.546964 -1.945978
C  -3.519388 0.487928 1.656228
C  -2.452621 -0.333249 2.018241
C  -5.162444 1.264773 -0.053671
C  -5.149806 0.290142 -2.294926
C  -5.69718 1.204044 -1.341153
C  0.63126 -2.034733 -1.220853
C  3.069792 -1.867884 -0.982977
C  3.414955 -1.02755 0.239799
C  2.884341 0.284215 0.310981
C  4.203736 -1.544316 1.294903
C  3.138975 1.067385 1.459174
C  4.458371 -0.740741 2.428783
C  3.927348 0.561864 2.519838
C  4.098028 -2.860411 -1.340095
C  1.619076 2.934034 0.872307
C  0.399502 2.23684 0.718739
C  1.775474 4.252648 0.394975
C  -0.672125 2.8745 0.054734
C  0.692638 4.880589 -0.25938
C  -0.53145 4.19343 -0.436499
H  -1.778388 -1.929724 -2.214324
H  -3.751121 -3.398736 -1.532693
H  -2.330215 -4.366314 -2.038699
H  -2.734533 -4.173552 -0.296266
H  -1.053097 -1.877746 1.372258
H  -0.28449 -3.666941 -0.365665
H  -3.68628 -1.229209 -2.702151
H  -3.947196 1.197817 2.373807
H  -2.029313 -0.278584 3.02697
H  -5.572519 1.963923 0.685024
H  -5.566299 0.25107 -3.307411
H  -6.531539 1.853827 -1.626419
H  2.8659 -1.21125 -1.851909
H  2.281427 0.675046 -0.515029
H  4.619059 -2.555502 1.227719
H  5.073789 -1.129528 3.246791
H  4.115702 1.200401 3.387975
H  0.278024 1.221168 1.107532
H  2.731926 4.762731 0.543593
H  -1.616155 2.3340 -0.07134
H  0.808897 5.903737 -0.633398
H  -1.366995 4.679403 -0.951223
