program: Gaussian 09
title: 000157193
version: EM64L-G09RevD.01
frameworkgroup: C1[X(C24H22ClF3O2)]
method: RPBEPBE
basis: SDD
operation: Freq
keyword: #p
keyword: freq=noraman
keyword: PBEPBE/SDD
title: #p freq=noraman PBEPBE/SDD
converged: YES YES NO NO
title: Mulliken charges:
elementType: Cl F F F O O C C C C C C C C C C C C C C C C C C C C C C C C H H H H H H H H H H H H H H H H H H H H H H
charge: -0.003964 -0.151286 -0.150303 -0.163504 -0.272809 -0.258444 0.315957 -0.396471 -0.269473 -0.723991 -0.740538 0.264530 0.017208 -0.051869 -0.269624 -0.563227 -0.578546 0.065538 0.323042 0.367908 0.227679 -0.449611 -0.417262 -0.233511 0.324656 -0.409130 -0.410505 -0.230519 -0.236557 -0.243002 0.275497 0.293824 0.232943 0.227830 0.210550 0.220590 0.213426 0.265821 0.238882 0.262255 0.252427 0.238751 0.254711 0.236075 0.243317 0.248850 0.226649 0.247186 0.243093 0.226565 0.227873 0.230512
chargesum: 0.00000
title: Mulliken charges with hydrogens summed into heavy atoms:
elementType: Cl F F F O O C C C C C C C C C C C C C C C C C C C C C C C C
charge: -0.003964 -0.151286 -0.150303 -0.163504 -0.272809 -0.258444 0.315957 -0.120975 0.024352 -0.052668 -0.040701 0.264530 0.256090 0.210386 -0.269624 -0.072049 -0.087759 0.065538 0.323042 0.367908 0.227679 -0.206294 -0.168412 -0.006862 0.324656 -0.161944 -0.167412 -0.003954 -0.008684 -0.012490
polarizability: 3.38730831e+02 2.95333042e+00 3.10731319e+02 2.12345343e+01 -6.45931423e+00 2.00742831e+02
1716.lowfreq: -7.8810 -3.1743 0.0013 0.0018 0.0020 3.5361 7.6739 16.7414 17.9930
frequency: 7.5717 16.5666 17.8632 22.1375 36.3084 43.9950 51.2549 69.8689 73.4501 84.4457 98.1870 115.0102 139.3409 155.5227 161.5366 172.2571 190.1350 201.3188 207.5772 224.3222 238.0400 239.6628 248.7905 281.1925 289.7157 311.2130 326.0667 336.4330 351.9122 366.9456 380.5832 407.0751 410.9289 428.6854 440.3629 457.3098 489.0827 489.6783 500.5635 506.4609 563.3705 571.7014 575.2580 595.1212 596.9260 618.5599 628.4158 654.4836 657.0524 704.4451 708.3655 718.0901 720.2558 750.2752 766.6780 782.4589 792.7731 802.0058 823.2816 854.8481 857.7352 878.5654 893.0363 896.1237 905.9071 911.7535 923.3705 933.9140 954.7960 967.9657 972.0460 976.6390 989.2647 990.5211 994.9919 997.4894 997.8648 1014.6657 1019.2264 1024.2294 1048.4873 1051.7505 1060.4496 1075.5755 1079.8868 1083.9388 1116.4478 1132.0318 1142.0982 1167.1735 1170.9001 1172.8272 1185.8110 1190.9019 1199.2803 1209.7157 1212.9908 1242.7863 1255.2652 1278.0989 1286.0988 1287.8043 1290.6999 1313.2476 1315.6893 1333.0488 1355.2831 1370.7791 1383.3035 1389.2440 1401.2284 1419.8757 1422.2181 1441.0999 1445.4027 1454.3167 1458.3181 1462.7327 1471.0042 1483.4127 1491.1376 1493.6095 1581.2128 1599.9292 1605.2957 1612.5374 1615.2405 1657.6823 2980.4347 2983.0118 2988.3120 2990.3404 3064.3603 3066.4718 3073.4329 3075.1265 3082.0596 3087.9307 3103.7126 3122.1463 3123.1985 3125.6033 3127.0990 3134.5975 3137.4154 3140.4302 3148.7412 3154.5863 3156.8894 3164.6626
redmass: 7.1802 8.0505 6.4269 5.9906 8.1964 9.9543 4.3961 6.3086 4.7458 4.5413 4.9766 5.5786 5.5594 3.3143 1.9480 3.6212 4.5308 1.8360 3.1918 4.0709 3.7941 1.7020 3.8133 3.9127 4.5011 3.6229 4.8716 9.0169 3.4862 2.9217 3.5042 2.8812 4.9676 4.1010 4.1018 3.4493 3.5218 6.1613 3.8197 3.4302 5.7857 3.5916 8.5665 9.1727 5.7700 6.2379 4.7780 6.4302 6.2775 3.8383 1.7462 3.8261 4.9561 3.5904 1.9148 4.2073 1.5920 5.3548 4.4853 1.3085 3.9076 3.5958 1.6148 1.9726 3.3506 1.7307 1.4754 2.3781 1.6327 1.8738 1.4179 1.4452 4.8734 1.7801 1.3152 5.4660 2.4629 2.0597 3.0672 2.5268 1.8950 1.9367 2.2805 2.3375 1.3684 1.7184 1.9144 2.0832 1.1227 1.7845 3.2073 1.0677 1.2501 1.1488 1.3938 2.2784 1.7313 3.3551 1.9207 1.5056 1.8973 1.9738 1.9175 2.0481 1.3880 1.3142 1.6543 5.8653 6.1463 1.2373 1.3258 2.2548 2.4788 1.3603 1.4696 1.3411 2.2885 1.0520 1.0496 1.1155 1.0589 2.8366 5.9330 7.7720 6.9206 6.1880 9.9108 8.4762 1.0366 1.0365 1.0668 1.0693 1.0948 1.0990 1.0885 1.0990 1.0991 1.0919 1.0990 1.0848 1.0857 1.0897 1.0874 1.0916 1.0880 1.0921 1.0965 1.0889 1.0991 1.1016
irintensity: 0.3837 0.1769 0.1264 0.0857 0.1647 0.0772 0.0137 0.2914 1.6338 1.0053 1.2204 0.3494 0.1499 0.5497 0.1943 1.0882 2.3036 0.3138 0.6278 8.4619 3.5721 4.7482 3.3747 4.6684 1.5056 4.9088 5.1308 0.7716 0.6655 2.0160 0.4584 0.0774 2.0476 22.4028 2.8618 4.5857 1.2690 0.9524 1.2861 8.4120 5.5919 6.2498 4.6927 9.9826 2.3376 0.1505 4.1559 6.9719 15.2789 15.6525 40.5071 0.8604 27.4439 59.7843 66.8480 2.6459 19.7304 16.7189 1.0799 2.3207 44.8643 6.0699 69.3111 1.2386 57.0589 5.5226 1.6196 2.7719 15.1117 18.4572 4.4941 2.9128 2.5042 34.5875 0.3090 117.8484 180.1009 82.8214 122.8531 8.9468 20.1615 91.9128 5.1059 1.3001 71.1297 6.3645 399.0175 236.3022 0.4906 1.2050 247.7495 4.1821 1.0148 0.5630 1.0895 163.8033 51.0657 82.0434 0.8735 34.1602 6.0646 20.5087 3.5494 3.6777 1.2361 49.1170 28.0955 0.8805 0.7707 32.2587 32.2838 72.1325 20.4542 8.7433 12.1684 0.4866 30.3568 10.3705 6.9806 8.4707 18.3737 6.2985 3.4165 6.9303 6.4409 4.2045 129.7237 94.1566 18.3904 39.6070 17.5056 15.3924 15.4946 14.7616 22.5402 37.1599 29.2797 9.9795 6.1317 5.1985 1.5523 2.9248 0.2565 21.1225 2.6230 12.7643 40.9163 1.7911 32.9043 21.9908
temp: 298.150 k
press: 1.00000 atm
elementType: 17 9 9 9 8 8 6 6 6 6 6 6 6 6 6 6 6 6 6 6 6 6 6 6 6 6 6 6 6 6 1 1 1 1 1 1 1 1 1 1 1 1 1 1 1 1 1 1 1 1 1 1
symmnumber: 1
zpe: 1041482.5 jmol-1
zpe.correction: 0.396680 hartree
zpe.thermalcorrener: 0.425008 hartree
zpe.thermalcorrenthalpy: 0.425953 hartree
zpe.thermalcorrgfe: 0.332762 hartree
zpe.sumelectzpe: -1835.606680 hartree
zpe.sumelectthermal: -1835.578351 hartree
zpe.sumelectthermalent: -1835.577407 hartree
zpe.sumelectthermalfe: -1835.670597 hartree
dipole: 4.2962 -2.1577 1.8601
dipole: 5.1549
quadrupole: -198.9571 -174.4640 -180.3149
quadrupole: 14.1064 -9.3200 -5.0647
quadrupole: -14.3784 10.1147 4.2638 14.1064 -9.3200 -5.0647
hfenergy: -1836.0033593 hartree
pointgroup: C01 [X(C24H22Cl1F3O2)]
dipole: 1.5801862 0.7125837 -1.0527926 debye
polarizability: 337.4336134|-8.3213283|295.6901294|-23.9337867|-38.0158647|217.0812385 unknown
InChI: InChI=1S/C24H22ClF3O2/c1-23(2)19(13-20(25)24(26,27)28)21(23)22(29)30-16-11-15-9-6-10-17(18(15)12-16)14-7-4-3-5-8-14/h3-10,13,16,19,21H,11-12H2,1-2H3
charge 0 multiplicity 1
52 atoms
Cl -5.790897 -0.162125 2.237299
F  -7.348584 -2.463767 0.730502
F  -5.782513 -3.312409 2.122232
F  -5.483234 -3.436591 -0.126206
O  0.175277 0.635594 0.444157
O  -1.439328 2.185986 1.12037
C  -3.049217 0.966559 -1.361374
C  -2.018297 0.338169 -0.387817
C  -3.54308 0.341658 -0.031329
C  -3.270975 0.218325 -2.675953
C  -3.158392 2.484568 -1.487147
C  -1.116369 1.163731 0.462388
C  -4.270837 -0.934355 0.021189
C  1.204699 1.363922 1.272027
C  -5.234572 -1.272425 0.915233
C  2.410458 0.402714 1.370017
C  1.713751 2.617214 0.513844
C  3.326939 0.834814 0.226428
C  2.931302 2.113511 -0.246411
C  -5.94847 -2.591299 0.913666
C  4.478527 0.191212 -0.297836
C  3.660322 2.776461 -1.251984
C  5.212332 0.877752 -1.307536
C  4.811059 2.145579 -1.782246
C  4.951371 -1.148769 0.169548
C  6.316744 -1.344233 0.515211
C  4.072745 -2.263921 0.243113
C  6.786016 -2.608537 0.934461
C  4.540661 -3.529251 0.65905
C  5.89913 -3.707152 1.010856
H  -1.57951 -0.610883 -0.707949
H  -3.801392 1.073357 0.74195
H  -2.573775 0.597597 -3.445006
H  -4.301851 0.377574 -3.042986
H  -3.103439 -0.869431 -2.58851
H  -4.171682 2.759549 -1.833385
H  -2.431845 2.861341 -2.231644
H  -2.964192 2.993276 -0.529133
H  -4.025797 -1.697287 -0.729444
H  0.729335 1.60786 2.236289
H  2.077024 -0.645587 1.32699
H  2.921967 0.537371 2.344121
H  0.93064 3.055473 -0.128037
H  1.997867 3.400188 1.245181
H  3.348035 3.761978 -1.616196
H  6.092951 0.390799 -1.741811
H  5.392571 2.63745 -2.569889
H  7.005896 -0.492626 0.47403
H  3.027474 -2.147868 -0.064442
H  7.840398 -2.734943 1.205164
H  3.848394 -4.377855 0.699172
H  6.261662 -4.688671 1.335885
