program: Gaussian 09
title: 000157188
version: EM64L-G09RevD.01
frameworkgroup: C1[X(C18H16O4)]
method: RPBEPBE
basis: SDD
operation: Freq
keyword: #pfreq=noraman
keyword: PBEPBE/SDD
title: #p freq=noraman PBEPBE/SDD
converged: YES YES NO NO
title: Mulliken charges:
elementType: O O O O C C C C C C C C C C C C C C C C C C H H H H H H H H H H H H H H H H
charge: -0.452271 -0.432685 -0.467802 -0.459354 -0.307316 -0.313666 -0.132748 -0.333705 0.215757 0.345719 0.190598 0.485890 -0.395223 -0.499249 -0.599110 -0.705979 0.414289 0.402519 -0.434402 -0.421389 -0.244412 -0.241296 0.254683 0.246883 0.261017 0.249727 0.246230 0.244408 0.263531 0.247440 0.362526 0.340022 0.368303 0.357671 0.242718 0.242190 0.229160 0.229327
chargesum: 0.00000
title: Mulliken charges with hydrogens summed into heavy atoms:
elementType: O O O O C C C C C C C C C C C C C C C C C C
charge: -0.089745 -0.092663 -0.099499 -0.101683 -0.052633 -0.066783 0.128269 -0.083979 0.215757 0.345719 0.190598 0.485890 -0.148994 -0.254841 -0.335579 -0.458539 0.414289 0.402519 -0.191684 -0.179199 -0.015252 -0.011970
polarizability: 3.61266874e+02 2.83601035e+01 2.18115030e+02 -8.53857487e+00 -4.07169066e+00 1.06276537e+02
1716.lowfreq: -7.8913 -0.0009 -0.0008 -0.0007 4.4352 14.3828 42.8627 56.7717 81.4191
frequency: 42.8553 56.6523 81.3943 113.5903 119.7683 139.1044 164.0407 209.7828 228.9577 240.5198 244.9240 254.2800 281.9704 287.7521 304.0140 308.4398 372.3387 396.7857 410.7433 416.9999 436.0397 471.1706 472.7044 487.5107 514.4307 529.2507 536.3573 547.2722 609.1095 613.1840 625.0821 650.3532 677.6961 722.0381 725.2954 753.5803 760.6262 775.7263 779.3983 802.9269 811.2057 826.9940 857.8978 877.4314 883.7346 892.2063 895.5065 926.7036 934.8394 947.4664 967.6491 979.8924 986.7425 991.1363 1008.1446 1014.8131 1044.1764 1070.2765 1115.8672 1131.4613 1168.0225 1172.4675 1173.6526 1183.0097 1193.8037 1210.4128 1220.5917 1232.9787 1239.2807 1276.9255 1286.0522 1291.5445 1299.1113 1306.7181 1325.1336 1328.1437 1343.5804 1372.0222 1380.0484 1401.1553 1407.7047 1418.8808 1424.7813 1437.6036 1440.1163 1465.1261 1486.1674 1555.6712 1568.7301 1590.5198 1631.4869 1638.4294 2976.1955 2993.0840 3020.5479 3066.2059 3118.5699 3120.5752 3125.3295 3126.0845 3143.4486 3150.7514 3153.1065 3162.4372 3310.8360 3469.6547 3487.9330 3528.6050
redmass: 6.2160 4.9104 5.3908 5.4144 5.9273 5.7150 5.9391 6.3159 3.8569 5.6366 4.7887 4.5642 4.6363 1.1161 4.7344 4.7581 1.5411 3.9150 4.9522 3.5805 4.7143 2.9501 3.9174 1.4669 3.4341 3.1760 4.0035 4.0210 5.0051 5.9506 4.9897 4.1805 5.1544 4.6546 1.2709 1.3093 4.7707 3.8462 3.1362 3.0500 2.5082 1.7304 1.5479 3.4916 4.1091 4.2778 1.6472 2.2744 4.1120 5.9368 1.3955 1.4267 3.9600 1.3516 3.7288 2.3064 3.0029 2.3398 2.1971 1.6769 1.3340 1.1916 1.3959 1.1556 1.3132 1.2548 1.3122 1.5478 1.5472 2.3012 1.7386 1.3575 1.7028 1.6624 1.3313 1.3699 1.7737 1.7453 1.5377 2.5242 2.5605 1.4625 1.7935 4.1222 7.6422 3.0968 3.0734 5.6195 8.5162 5.6071 7.0388 6.6528 1.0837 1.0857 1.0862 1.0866 1.0908 1.0863 1.0881 1.0873 1.0952 1.0980 1.0905 1.1003 1.0666 1.0655 1.0642 1.0661
irintensity: 0.1524 0.5646 4.2342 0.8914 0.7316 1.1752 18.2341 10.0450 32.8275 27.2865 13.5233 1.1203 3.0432 113.8876 24.6440 10.4328 152.4417 2.7333 2.1120 16.9860 7.2769 14.1099 7.5991 75.6699 22.4490 27.7050 22.3889 5.4442 13.1641 1.5486 2.2428 8.9783 1.2219 9.5173 30.3434 72.9143 5.8066 3.9388 1.0602 14.7549 18.1295 33.3807 2.1566 13.3398 5.1605 19.9334 49.0354 34.2631 16.3038 55.8719 9.6517 5.5644 48.7149 0.1083 128.9628 3.2501 8.6778 36.5365 9.1364 7.9152 40.2106 6.4289 2.3993 9.4403 19.0408 69.8638 23.5292 4.2211 8.0074 3.3154 4.9813 13.4674 9.0551 3.3865 1.0581 28.6471 1.2705 33.6960 5.0924 11.6186 5.7319 46.7498 27.6190 2.8091 0.6145 0.1625 4.1776 10.0818 2.0159 0.2022 4.5370 0.4040 24.1894 31.0928 41.7327 14.4500 4.6474 6.6054 0.2655 3.9472 29.8424 26.7127 5.4384 44.3236 85.4482 25.6922 8.4431 6.3728
temp: 298.150 k
press: 1.00000 atm
elementType: 8 8 8 8 6 6 6 6 6 6 6 6 6 6 6 6 6 6 6 6 6 6 1 1 1 1 1 1 1 1 1 1 1 1 1 1 1 1
symmnumber: 1
zpe: 782070.9 jmol-1
zpe.correction: 0.297875 hartree
zpe.thermalcorrener: 0.315711 hartree
zpe.thermalcorrenthalpy: 0.316656 hartree
zpe.thermalcorrgfe: 0.253252 hartree
zpe.sumelectzpe: -994.852798 hartree
zpe.sumelectthermal: -994.834962 hartree
zpe.sumelectthermalent: -994.834018 hartree
zpe.sumelectthermalfe: -994.897421 hartree
dipole: -1.2152 -0.2006 -0.2573
dipole: 1.2582
quadrupole: -118.3927 -109.2196 -139.2595
quadrupole: 1.3374 -0.9875 -0.3067
quadrupole: 3.8979 13.0710 -16.9689 1.3374 -0.9875 -0.3067
hfenergy: -995.1506734 hartree
pointgroup: C01 [X(C18H16O4)]
dipole: 0.4795881 -0.073451 0.0981994 debye
polarizability: 361.0058232|-28.7900493|218.2311501|-10.7910977|-1.4121812|106.421469 unknown
InChI: InChI=1S/C18H16O4/c19-15-12-6-5-11-7-9-3-1-2-4-10(9)8-13(11)14(12)16(20)18(22)17(15)21/h1-8,15-22H
charge 0 multiplicity 1
38 atoms
O  -3.474539 -1.444139 -1.490578
O  -1.293651 -2.041046 1.52705
O  -5.337972 -0.584195 0.47144
O  -3.932206 1.264171 -1.020468
C  -3.12753 -1.547318 -0.060058
C  -1.605753 -1.459961 0.191167
C  -3.891815 -0.480413 0.738898
C  -3.405546 0.933106 0.345277
C  -1.050121 -0.044264 0.193031
C  -1.89867 1.066272 0.268741
C  0.387627 0.151322 0.102467
C  0.919788 1.510574 0.056136
C  -1.35904 2.400881 0.237987
C  0.003698 2.619497 0.12711
C  1.302768 -0.929407 0.061289
C  2.31625 1.716772 -0.048834
C  2.701433 -0.725748 -0.044597
C  3.226009 0.633851 -0.106615
C  3.629891 -1.827105 -0.088483
C  4.649782 0.827272 -0.215608
C  4.99929 -1.603579 -0.193635
C  5.515075 -0.261451 -0.259008
H  -3.476882 -2.556798 0.22803
H  -1.116361 -2.057208 -0.606183
H  -3.741227 -0.64275 1.819373
H  -3.820778 1.673987 1.056888
H  -2.05618 3.244571 0.286614
H  0.403953 3.639428 0.094663
H  0.932596 -1.955706 0.143479
H  2.700448 2.744108 -0.083703
H  -3.44391 -0.470475 -1.739524
H  -1.47772 -3.016402 1.495852
H  -5.429867 -1.085019 -0.385651
H  -4.924891 1.231501 -0.939122
H  3.236802 -2.849554 -0.038166
H  5.040648 1.850767 -0.262637
H  5.695433 -2.448755 -0.227034
H  6.596168 -0.10469 -0.341889
