program: Gaussian 09
title: 000157163
version: EM64L-G09RevD.01
frameworkgroup: C1[X(C18H21ClN2O2S)]
method: RPBEPBE
basis: SDD
operation: Freq
keyword: #p
keyword: freq=noraman
keyword: PBEPBE/SDD
title: #p freq=noraman PBEPBE/SDD
converged: YES YES NO NO
title: Mulliken charges:
elementType: Cl S O O N N C C C C C C C C C C C C C C C C C C H H H H H H H H H H H H H H H H H H H H H
charge: -0.043736 0.230302 -0.235228 -0.157873 -0.252092 -0.169312 -0.130009 -0.425057 0.191140 -0.433258 -0.490681 0.277510 -0.751009 -0.461961 -0.816862 0.301412 0.664733 -0.134280 -0.434376 -0.720053 -0.311026 -0.253389 -0.235298 -0.250628 0.249918 0.203674 0.214485 0.207992 0.212712 0.227519 0.221470 0.232865 0.222157 0.211136 0.311580 0.241414 0.247008 0.225008 0.254579 0.294862 0.304269 0.241728 0.249113 0.231933 0.235610
chargesum: 0.00000
title: Mulliken charges with hydrogens summed into heavy atoms:
elementType: Cl S O O N N C C C C C C C C C C C C C C C C C C
charge: -0.043736 0.230302 -0.235228 -0.157873 -0.252092 -0.169312 0.119909 -0.006898 0.191140 -0.012554 -0.041692 0.277510 -0.084852 0.091033 -0.090267 0.301412 0.664733 -0.134280 -0.434376 -0.120923 -0.069298 -0.004276 -0.003366 -0.015018
polarizability: 2.69798922e+02 -2.48426478e+01 2.47783653e+02 -2.42945299e+01 -1.50467743e+01 1.77183793e+02
1716.lowfreq: -1.4438 -0.0007 -0.0007 -0.0002 3.3613 9.7907 26.3736 32.6156 34.1697
frequency: 26.3191 32.5851 34.1008 44.1454 61.0695 69.7182 76.1073 97.7435 122.0240 131.3513 141.5571 151.2738 164.3409 209.3544 224.3298 233.4935 240.3833 259.1732 282.2047 294.9749 308.9273 331.5760 346.2669 372.9282 387.0537 392.6810 409.4378 429.5981 441.2969 457.2269 472.2598 490.9801 515.2644 518.1945 541.1520 548.9392 586.9285 608.0202 641.5392 667.6689 677.5016 687.2792 695.2931 720.8280 745.2632 752.4878 801.2830 825.9837 831.5327 846.4743 862.4434 882.4477 904.4088 922.2461 929.9870 962.6600 968.5472 975.2036 976.7054 990.2557 1006.0815 1027.6320 1029.6311 1034.1754 1057.1660 1081.6553 1100.9811 1110.2927 1119.1907 1133.0470 1143.1940 1170.3061 1178.2934 1180.6475 1187.5761 1195.1027 1229.0715 1253.7480 1262.1719 1275.9187 1287.5681 1307.6791 1313.5124 1324.0461 1339.6616 1346.5095 1352.9846 1357.8827 1379.3764 1386.1694 1395.2361 1396.0939 1426.5432 1444.0325 1447.5902 1464.0021 1466.4684 1469.6595 1472.0165 1478.2467 1479.0044 1481.8676 1490.6878 1587.1948 1595.3669 1602.4543 1671.8660 1672.2597 2950.1833 2965.0964 2968.9766 2977.8232 2983.0180 2986.3220 3004.7061 3031.5715 3036.0744 3041.2857 3050.8186 3072.0408 3077.0592 3078.2944 3098.5460 3100.5226 3139.5458 3152.4033 3168.6235 3168.9191 3179.7971
redmass: 6.8635 4.8785 6.7855 5.9870 4.5410 5.3706 6.0229 5.9149 4.2561 3.8817 4.6786 3.6682 3.7838 5.4020 3.7432 1.2853 1.4538 1.9783 2.1074 3.4999 5.1612 6.1886 2.1709 2.9649 2.6538 2.3942 10.7929 3.1696 3.3237 10.1572 5.6629 4.6840 3.7996 4.1726 3.9284 4.0678 7.1624 3.9446 6.4268 6.5875 4.7598 5.5424 3.6104 2.9597 6.0928 1.4540 2.9505 1.9029 3.3264 1.3863 1.8415 2.3677 1.8179 3.2241 1.3861 1.7836 3.7487 1.3292 1.5736 1.6333 3.3597 2.4450 1.5588 3.6992 1.6951 2.0122 2.2340 1.8428 1.8545 1.6124 1.6601 1.5422 1.2814 1.6358 2.0408 2.6410 2.1606 1.3031 1.2029 1.4589 2.4698 1.7293 2.0023 1.5959 1.6144 1.4977 1.5741 1.7422 1.2278 1.3694 1.2787 4.5643 1.1051 2.4096 1.0949 2.3593 1.0812 1.1533 1.0911 1.0632 1.0846 1.0778 1.0587 6.9820 8.9022 6.9599 7.6929 10.1946 1.0623 1.0773 1.0394 1.0359 1.0667 1.0690 1.0888 1.0601 1.0962 1.0985 1.1030 1.0987 1.0994 1.0559 1.1033 1.0972 1.0858 1.0907 1.0957 1.1115 1.0976
irintensity: 0.1144 0.4359 0.7162 1.3604 1.2768 0.7350 1.9285 1.2390 0.0301 1.1007 1.2876 1.3586 0.8801 1.9889 0.9259 0.4317 0.4223 1.3371 0.1334 2.0647 4.0412 1.6269 9.5325 3.9855 1.9513 5.4057 11.3175 13.9140 5.7466 4.9758 10.6130 1.1865 2.0087 23.2477 0.6144 3.0499 42.9995 9.1257 2.8494 8.5360 15.9213 5.6028 11.6038 9.4391 3.1211 95.6045 2.7729 3.9175 12.0077 0.8226 4.5098 0.7642 5.6598 0.6973 2.4444 5.7885 18.0086 0.3622 10.3925 8.7042 19.5452 13.2344 16.5708 20.4427 13.3028 38.8830 0.5587 7.1646 132.3890 16.7196 14.0002 49.2898 44.3068 0.8585 49.7327 47.6860 14.6097 22.4941 0.8597 37.8249 18.8191 45.4015 79.6595 25.5892 0.6129 6.3107 2.0633 2.0616 12.6266 11.0354 10.2083 2.3057 22.7812 5.9408 8.8631 74.2362 5.9060 36.4644 35.5217 19.2121 16.2446 2.8833 22.7675 5.3273 205.6079 16.1855 114.0818 363.2927 24.9467 8.7200 32.5647 24.3902 25.5386 16.9816 31.8437 24.8126 19.3468 43.1941 61.5795 55.3200 27.7512 6.9711 8.8842 10.9211 1.2611 8.3432 19.0015 3.1672 6.4314
temp: 298.150 k
press: 1.00000 atm
elementType: 17 16 8 8 7 7 6 6 6 6 6 6 6 6 6 6 6 6 6 6 6 6 6 6 1 1 1 1 1 1 1 1 1 1 1 1 1 1 1 1 1 1 1 1 1
symmnumber: 1
zpe: 937672.0 jmol-1
zpe.correction: 0.357140 hartree
zpe.thermalcorrener: 0.380445 hartree
zpe.thermalcorrenthalpy: 0.381389 hartree
zpe.thermalcorrgfe: 0.303301 hartree
zpe.sumelectzpe: -1814.832297 hartree
zpe.sumelectthermal: -1814.808992 hartree
zpe.sumelectthermalent: -1814.808048 hartree
zpe.sumelectthermalfe: -1814.886136 hartree
dipole: -2.3905 7.3386 1.3726
dipole: 7.8392
quadrupole: -159.5762 -169.3444 -151.3312
quadrupole: 1.2528 5.3481 -5.5124
quadrupole: 0.5077 -9.2605 8.7528 1.2528 5.3481 -5.5124
hfenergy: -1815.1894371 hartree
pointgroup: C01 [X(C18H21Cl1N2O2S1)]
dipole: 0.5733336 -3.0074971 0.3719538 debye
polarizability: 258.8723644|-30.0209589|251.4889635|31.057228|15.0238083|184.40504 unknown
InChI: InChI=1S/C18H21ClN2O2S/c1-12-6-5-7-13(2)17(12)21(16(22)10-19)11-20-14-8-3-4-9-15(14)24-18(20)23/h3-4,8-9,12H,5-7,10-11H2,1-2H3
charge 0 multiplicity 1
45 atoms
Cl -4.88274 1.500597 -0.378824
S  3.333131 1.498036 1.243492
O  -1.903273 2.994602 -1.017419
O  1.097539 3.039492 0.603192
N  -1.199051 0.835219 -0.426221
N  1.287654 0.896624 -0.391762
C  -2.499097 -1.292185 -0.873221
C  -3.051268 -2.5467 -0.145391
C  -1.541598 -0.510662 0.039072
C  -1.926015 -3.306637 0.585526
C  -1.330698 -2.407512 1.687099
C  -1.064458 -0.976314 1.235436
C  -1.893206 -1.657149 -2.256473
C  0.052072 1.052775 -1.187747
C  -0.277027 -0.139518 2.222432
C  -2.090959 1.925706 -0.36957
C  2.128849 -0.244188 -0.419246
C  1.69887 1.963444 0.426241
C  3.287089 -0.10683 0.3961
C  -3.276367 1.786648 0.581387
C  1.927245 -1.432313 -1.155955
C  4.244259 -1.132731 0.485898
C  2.889259 -2.462389 -1.068137
C  4.03999 -2.3197 -0.255662
H  -3.35581 -0.616777 -1.078798
H  -3.560034 -3.200812 -0.878374
H  -3.815236 -2.236392 0.595441
H  -1.133396 -3.589653 -0.134645
H  -2.308612 -4.245342 1.0276
H  -0.381768 -2.835692 2.069879
H  -2.016287 -2.376644 2.561369
H  -2.660454 -2.149122 -2.881862
H  -1.555585 -0.76103 -2.807406
H  -1.041905 -2.355625 -2.156432
H  -0.001376 2.091122 -1.559639
H  0.120077 0.36024 -2.040141
H  0.779245 -0.468627 2.272576
H  -0.691592 -0.274754 3.240722
H  -0.290245 0.935419 1.982653
H  -3.192548 0.946754 1.282106
H  -3.425069 2.745112 1.096438
H  1.040432 -1.565165 -1.780556
H  5.13108 -1.012986 1.115735
H  2.738136 -3.384208 -1.639683
H  4.776251 -3.127729 -0.199231
