program: Gaussian 09
title: 000157153
version: EM64L-G09RevD.01
frameworkgroup: C1[X(C7H3ClF4)]
method: RPBEPBE
basis: SDD
operation: Freq
keyword: #p
keyword: freq=noraman
keyword: PBEPBE/SDD
title: #p freq=noraman PBEPBE/SDD
converged: NO YES NO NO
title: Mulliken charges:
elementType: Cl F F F F C C C C C C C H H H
charge: 0.018891 -0.162622 -0.162154 -0.162203 -0.166659 0.314651 -0.286322 -0.345408 0.273035 -0.280399 -0.313417 0.434317 0.288967 0.276293 0.273029
chargesum: 0.00000
title: Mulliken charges with hydrogens summed into heavy atoms:
elementType: Cl F F F F C C C C C C C
charge: 0.018891 -0.162622 -0.162154 -0.162203 -0.166659 0.314651 0.002645 -0.069114 0.273035 -0.280399 -0.040387 0.434317
polarizability: 1.12386061e+02 -8.24079130e+00 9.55280155e+01 -1.51899734e-03 -9.21625384e-04 3.98274035e+01
1716.lowfreq: -18.1638 0.0015 0.0018 0.0023 4.4211 11.6636 12.6370 91.4104 135.8219
frequency: -17.6901 91.4072 135.8209 150.2429 217.3550 241.9145 289.7121 304.9375 370.8048 393.5922 434.7576 471.9118 477.0449 528.7109 574.8301 608.1463 660.8843 696.0636 713.6120 828.4770 828.5058 880.3443 956.7003 991.1316 1010.1253 1035.5851 1046.2116 1145.8437 1219.1006 1249.8204 1288.3879 1381.0539 1396.1573 1486.8500 1590.2298 1610.4387 3170.2086 3172.3994 3190.3355
redmass: 13.9787 12.2637 15.6429 5.9933 16.6682 10.8858 14.5276 17.7233 9.1205 10.5312 3.3111 9.3691 8.1242 8.0486 11.8312 5.2543 9.4601 8.9220 3.8834 6.3240 1.4850 1.4680 1.4059 8.3274 6.9521 5.6306 3.9658 1.3317 2.1351 1.7630 3.5697 6.0233 4.8391 3.2601 8.2905 6.9253 1.0936 1.0892 1.0977
irintensity: 0.0009 2.1760 2.0470 0.2842 1.0280 0.0432 2.0436 1.8185 1.3745 3.7714 6.0597 2.7910 0.2238 5.8366 35.6439 4.0274 7.8946 34.9802 2.1168 20.4332 63.9372 33.9880 15.7509 213.5619 204.4665 12.6945 92.9031 3.0437 0.9726 108.3706 335.4480 10.2164 26.1054 34.3348 2.3269 33.3720 1.1873 0.1127 0.5876
temp: 298.150 k
press: 1.00000 atm
elementType: 17 9 9 9 9 6 6 6 6 6 6 6 1 1 1
symmnumber: 1
zpe: 220350.1 jmol-1
zpe.correction: 0.083927 hartree
zpe.thermalcorrener: 0.093473 hartree
zpe.thermalcorrenthalpy: 0.094417 hartree
zpe.thermalcorrgfe: 0.048258 hartree
zpe.sumelectzpe: -1127.107069 hartree
zpe.sumelectthermal: -1127.097523 hartree
zpe.sumelectthermalent: -1127.096579 hartree
zpe.sumelectthermalfe: -1127.142738 hartree
dipole: 0.6311 1.7273 -0.0008
dipole: 1.8390
quadrupole: -87.5375 -66.1893 -75.8461
quadrupole: -2.5454 0.0018 -0.0002
quadrupole: -11.0132 10.3350 0.6782 -2.5454 0.0018 -0.0002
hfenergy: -1127.1909961 hartree
pointgroup: C01 [X(C7H3Cl1F4)]
dipole: -0.3339768 -0.6418357 -0.0004638 debye
dipolederiv: -0.3191256 0.2812455 -0.0002769 0.337067 -0.4230787 0.0003148 -0.0002788 0.0002715 -0.0102115 -0.6368754 0.2637045 -0.000094 0.201267 -0.6215122 -0.0001258 -0.0002062 -0.0000127 -0.2861533 -0.603339 -0.1245572 0.1556345 -0.2094128 -0.4151076 0.2340274 0.178219 0.1986935 -0.6344841 -0.6031479 -0.1241575 -0.155835 -0.208894 -0.4146227 -0.2339876 -0.1786491 -0.1986577 -0.6353774 -1.0070341 -0.1915365 -0.0006061 -0.1575221 -0.2023049 -0.0001044 -0.0006046 -0.0001256 -0.1232115 -0.4504149 -0.0390318 -0.0001437 -0.0393996 -0.0549585 -0.0000578 0.0000347 -0.0000404 -0.1755275 -0.0573907 0.1713792 -0.0000622 0.0339367 -0.0998724 0.0000197 -0.000061 0.000097 -0.0387843 0.0666815 -0.0106806 0.0001117 0.0814913 0.0334048 0.0000665 -0.0000175 0.0000141 -0.1030099 2.1298573 0.0309448 0.0004575 0.2357896 1.354413 0.0001237 0.0007364 0.0000362 1.5682286 0.3525342 -0.5717619 0.0004228 -0.6930818 0.5679205 -0.0006094 0.0004299 -0.0005308 -0.0809892 -0.1934079 -0.0243457 -0.0000362 0.1651745 -0.0008144 0.0000961 -0.0000524 -0.000021 -0.1364166 1.068769 0.3401982 0.0006131 0.2697259 0.1687772 0.0002023 0.0005876 0.0002417 0.1414974 0.1062155 -0.0252994 -0.0000371 -0.0247591 0.046899 -0.0000025 -0.0000245 0.0000229 0.1632526 0.0789441 0.0543494 -0.0000633 0.0495921 0.0494075 0.000047 -0.0000437 0.0000178 0.1665192 0.0677339 -0.0304511 -0.0000852 -0.0409748 0.0114493 -0.0000099 -0.0000698 -0.0000064 0.1846675 unknown
polarizability: 109.9942411|-10.1247482|97.9197895|0.0563807|-0.0151273|39.8274496 unknown
InChI: InChI=1S/C7H3ClF4/c8-5-3-4(7(10,11)12)1-2-6(5)9/h1-3H
charge 0 multiplicity 1
15 atoms
Cl -2.707221 2.154052 -0.002281
F  2.937048 -1.071184 0.001575
F  2.593821 0.869433 -1.128432
F  2.592747 0.86804 1.133155
F  -3.443633 -0.778019 -0.002367
C  0.693453 -0.142801 0.000471
C  -0.178819 0.972475 -0.0002
C  0.18851 -1.462148 0.000372
C  2.17375 0.116741 0.001626
C  -1.567011 0.757871 -0.001214
C  -1.205127 -1.67354 -0.000687
C  -2.065815 -0.563578 -0.00143
H  0.212255 1.994174 -0.000094
H  0.873577 -2.313654 0.000914
H  -1.633334 -2.679562 -0.000908
