program: Gaussian 09
title: 000157135
version: EM64L-G09RevD.01
frameworkgroup: C1[X(C22H30O6)]
method: RPBEPBE
basis: SDD
operation: Freq
keyword: #pfreq=noraman
keyword: PBEPBE/SDD
title: #p freq=noraman PBEPBE/SDD
converged: NO YES NO NO
title: Mulliken charges:
elementType: O O O O O O C C C C C C C C C C C C C C C C C C C C C C H H H H H H H H H H H H H H H H H H H H H H H H H H H H H H
charge: -0.214771 -0.429049 -0.454894 -0.286788 -0.246068 -0.244177 0.270205 -0.321797 0.224962 -0.157488 0.098678 -0.363541 0.315451 -0.592308 -0.060989 -0.402479 -0.508103 -0.291496 -0.491355 -0.079805 -0.450207 -0.454130 0.565438 -0.770297 -0.782257 -0.759334 0.285619 -0.758610 0.267769 0.227345 0.298954 0.277668 0.282207 0.265289 0.204289 0.229543 0.225533 0.197255 0.250452 0.228469 0.248837 0.189988 0.206098 0.204362 0.212832 0.272450 0.200904 0.202599 0.215127 0.214286 0.230046 0.381684 0.372146 0.243433 0.262224 0.247595 0.251241 0.248964
chargesum: 0.00000
title: Mulliken charges with hydrogens summed into heavy atoms:
elementType: O O O O O O C C C C C C C C C C C C C C C C C C C C C C
charge: -0.214771 -0.047365 -0.082749 -0.286788 -0.246068 -0.244177 0.270205 -0.054028 0.224962 0.069857 0.098678 -0.064588 0.315451 -0.032432 0.204300 0.031354 -0.085315 -0.041044 -0.014048 -0.079805 -0.054121 -0.036936 0.565438 -0.094343 -0.122797 -0.253677 0.285619 -0.010811
polarizability: 2.64763234e+02 5.71895474e+00 2.62029778e+02 -6.35169597e+00 -1.40582658e+01 2.02382879e+02
1716.lowfreq: -24.1865 -17.8334 -4.5091 -0.0005 -0.0004 0.0001 4.1694 29.3498 34.5778
frequency: -23.9814 29.1542 34.4243 57.1675 65.9033 82.3411 99.2821 119.2257 150.5009 168.3814 176.0318 186.0755 196.1064 199.3148 208.8909 224.4170 234.4503 238.8772 254.6229 258.4683 273.8332 280.9347 300.8852 304.7823 315.1192 325.8013 345.4416 363.9658 376.6543 390.4711 408.9279 418.1583 418.4700 442.6023 468.8368 471.2537 486.4673 489.1476 503.3402 512.6888 550.4413 563.9853 577.5184 589.7862 606.7573 618.8431 632.2474 659.5370 678.0636 704.3261 732.9895 753.8161 772.3206 794.2161 807.6782 823.6767 835.3013 848.4555 852.4023 874.7420 888.9772 896.3623 904.2214 910.6432 921.7351 927.0765 934.9786 941.6440 948.4989 967.0425 976.0037 983.6302 991.8461 994.4661 998.0335 1001.7547 1024.8040 1035.9887 1039.5281 1046.7096 1055.9130 1066.4723 1072.4803 1076.6464 1084.8281 1094.2785 1114.7823 1134.4116 1143.1910 1154.2803 1166.8439 1171.5573 1182.3695 1185.3815 1195.5466 1202.7679 1208.8204 1217.4307 1223.2809 1252.6276 1253.8463 1272.2698 1278.7781 1282.3040 1292.9729 1297.7816 1307.5934 1311.4611 1322.5456 1330.0037 1334.3042 1340.2300 1344.3300 1348.3426 1351.8408 1355.1793 1369.8919 1371.3503 1381.8624 1385.6569 1398.8295 1420.6189 1431.5627 1451.6270 1453.7796 1457.1186 1460.1962 1462.3228 1466.3941 1473.7777 1478.1153 1479.0384 1488.5950 1493.2988 1498.2211 1595.3339 1645.1556 1664.4903 2935.0033 2947.3852 2952.4219 2955.1308 2966.3393 2981.9789 2985.6132 3000.4553 3005.0838 3009.9080 3017.4297 3023.4672 3033.9302 3039.5411 3041.4101 3050.4472 3054.5830 3057.0990 3064.6893 3067.6297 3079.0300 3083.7297 3086.0302 3090.5692 3093.0762 3130.7581 3140.7532 3199.1283 3209.3894 3445.9741
redmass: 1.0754 6.2783 6.4054 3.3520 3.2075 3.4296 5.2577 3.8405 5.4289 3.7988 4.2838 4.2038 2.1779 2.0344 4.8380 3.8012 2.6831 1.4134 2.9330 2.9615 2.7914 2.7044 2.5236 2.9470 3.1549 3.7340 3.3439 2.2358 3.0917 1.8096 2.8767 2.6488 3.3144 2.6892 3.5168 3.9164 2.8355 4.1310 3.0999 2.5256 5.0914 3.8051 3.3132 4.5306 4.5775 4.2563 4.1884 3.2794 2.1438 2.8982 3.2716 3.0095 3.4198 1.5840 1.8263 2.5232 2.9206 3.1273 1.6789 2.8639 3.7024 4.7650 2.8476 2.9025 2.6371 1.7970 2.3025 2.3445 2.4108 2.3040 2.8318 2.3583 1.9265 2.0558 1.5402 2.2896 2.0321 1.9865 1.6713 2.2558 2.1344 2.9397 2.3212 1.8192 2.6446 1.8971 2.9695 3.0042 2.3016 2.0768 2.5116 1.7302 1.8850 1.4759 1.9726 1.6014 1.9127 2.0003 1.7754 1.8080 1.7570 1.7800 1.4407 2.0094 1.3904 1.5457 1.4293 1.4368 1.3193 1.4360 1.4161 1.4162 1.3414 1.4251 1.2265 1.3017 1.4608 1.3619 1.2244 1.2442 1.2041 1.1854 1.1589 1.0620 1.0495 1.0752 1.0786 1.0602 1.0785 1.0697 1.0747 1.0740 1.0791 1.0688 1.0590 10.0945 9.1270 6.2956 1.0829 1.0775 1.0637 1.0653 1.0370 1.0408 1.0594 1.0631 1.0376 1.0625 1.0978 1.0944 1.0847 1.0725 1.1026 1.0825 1.0941 1.0894 1.0979 1.0967 1.1002 1.0994 1.0983 1.0610 1.0964 1.1007 1.1012 1.1151 1.0673 1.0649
irintensity: 1.2442 1.5407 1.4338 0.0863 1.8772 2.4217 0.7401 0.7925 1.1060 5.2412 6.1276 1.0432 2.8363 7.5498 17.7950 9.3302 12.7131 6.7966 7.6786 7.6535 6.0078 3.8636 1.6628 2.0015 4.3722 16.9512 13.7549 14.1991 1.3389 33.2310 3.8030 1.6713 0.8080 3.2633 6.1526 0.5095 0.2334 3.1742 5.2939 1.5776 4.7244 12.7903 8.1685 1.6878 10.1053 1.2785 1.9126 2.8184 5.1532 3.6131 3.1282 5.1612 1.2952 124.0376 49.6557 12.0070 7.2268 3.9840 3.3901 1.5009 22.3576 105.2157 2.0702 22.6918 35.2187 1.0342 29.0391 62.7958 6.0120 12.8542 81.6449 32.5787 58.5946 76.2677 35.3996 6.8516 10.9876 14.0259 7.1680 74.1386 19.6853 7.9951 3.7687 3.3369 20.9292 37.7422 8.0818 38.4115 9.6216 12.1789 14.7583 11.1238 113.5047 89.6816 129.5067 19.6389 86.6261 0.7233 7.7766 7.4287 28.0189 21.5481 19.7123 12.1152 17.8700 1.4761 9.0531 9.1940 9.7707 1.8007 1.6488 2.6902 6.7719 0.6285 5.5945 0.3922 48.4232 20.8369 31.7170 58.5092 27.2739 32.4246 102.5873 23.9605 17.1114 6.5348 10.7554 1.9804 2.9566 18.4377 2.0412 14.3856 22.8569 9.9218 12.1777 132.0880 181.0026 7.4671 5.0914 6.2519 23.6502 45.8225 49.4644 13.8810 25.1980 17.2400 3.1729 66.0451 38.0879 57.7579 11.8948 6.6792 44.7322 18.3972 5.6109 83.5083 28.8244 46.1067 34.3977 11.7086 22.9331 7.3916 7.3168 2.4798 10.8215 4.8518 354.5505 57.2222
temp: 298.150 k
press: 1.00000 atm
elementType: 8 8 8 8 8 8 6 6 6 6 6 6 6 6 6 6 6 6 6 6 6 6 6 6 6 6 6 6 1 1 1 1 1 1 1 1 1 1 1 1 1 1 1 1 1 1 1 1 1 1 1 1 1 1 1 1 1 1
symmnumber: 1
zpe: 1271602.7 jmol-1
zpe.correction: 0.484328 hartree
zpe.thermalcorrener: 0.509630 hartree
zpe.thermalcorrenthalpy: 0.510574 hartree
zpe.thermalcorrgfe: 0.431910 hartree
zpe.sumelectzpe: -1305.517437 hartree
zpe.sumelectthermal: -1305.492135 hartree
zpe.sumelectthermalent: -1305.491191 hartree
zpe.sumelectthermalfe: -1305.569855 hartree
dipole: 2.1590 -2.0840 -2.0227
dipole: 3.6188
quadrupole: -161.7438 -168.0019 -175.3893
quadrupole: 15.1222 5.1409 -11.8732
quadrupole: 6.6345 0.3765 -7.0110 15.1222 5.1409 -11.8732
hfenergy: -1306.0017646 hartree
pointgroup: C01 [X(C22H30O6)]
dipole: -0.7761367 -0.9345292 0.7424932 debye
polarizability: 265.955768|-5.1347235|259.504376|-7.2897346|16.2059633|203.7157469 unknown
InChI: InChI=1S/C22H30O6/c1-11-13-8-14(28-12(2)23)15-20-7-5-6-19(3,4)16(20)18(25)22(26,27-10-20)21(15,9-13)17(11)24/h13-16,18,25-26H,1,5-10H2,2-4H3
charge 0 multiplicity 1
58 atoms
O  0.430872 0.028593 -2.278359
O  0.416134 2.380071 -2.274368
O  2.444301 2.517761 -0.406726
O  -2.080462 -1.710374 -0.552292
O  0.213492 3.073917 1.038905
O  -3.188309 -3.274554 0.785617
C  0.835707 -0.909886 0.024658
C  -0.444742 -0.120816 0.490818
C  -0.610985 1.184952 -0.410979
C  2.055677 0.07692 0.283072
C  0.558051 1.236262 -1.424518
C  1.98996 1.184663 -0.811682
C  3.494608 -0.553529 0.460208
C  -2.013301 1.221583 -1.080902
C  -1.773025 -0.893805 0.675671
C  0.725603 -1.208169 -1.496031
C  0.952387 -2.221046 0.849526
C  -2.92595 1.394866 0.168127
C  -2.971198 0.04762 0.970005
C  -0.727328 2.362527 0.572228
C  3.387355 -1.819537 1.361783
C  2.362819 -2.84433 0.838556
C  -2.176255 2.480823 0.940178
C  4.391252 0.491016 1.184322
C  4.2111 -0.933502 -0.868114
C  -2.652734 3.425391 1.790745
C  -2.822001 -2.884559 -0.346415
C  -3.104833 -3.566957 -1.666225
H  -0.212983 0.199465 1.530456
H  1.844536 0.569496 1.258022
H  2.643638 0.927526 -1.661737
H  -2.22327 0.311895 -1.659161
H  -2.073145 2.094756 -1.753193
H  -1.675687 -1.618276 1.50482
H  1.665154 -1.640932 -1.884994
H  -0.102521 -1.906649 -1.695694
H  0.200678 -2.951437 0.492035
H  0.694084 -1.995384 1.906297
H  -3.952699 1.712655 -0.079079
H  -3.003358 0.255078 2.056515
H  -3.897903 -0.504388 0.732963
H  3.088112 -1.511943 2.386596
H  4.391263 -2.279159 1.451402
H  2.365361 -3.747062 1.479277
H  2.636947 -3.182103 -0.179499
H  4.445284 1.433028 0.612233
H  3.990308 0.730313 2.18816
H  5.415753 0.0926 1.314586
H  5.174727 -1.422026 -0.629738
H  3.635872 -1.632048 -1.499743
H  4.445952 -0.041719 -1.475472
H  1.242837 2.927718 -2.160726
H  1.799392 2.858969 0.292473
H  -3.718119 3.509296 2.033808
H  -1.965658 4.147518 2.248436
H  -2.195003 -3.610783 -2.288052
H  -3.858064 -2.988311 -2.230855
H  -3.492083 -4.579992 -1.484743
