program: Gaussian 09
title: 000157126
version: EM64L-G09RevD.01
frameworkgroup: C1[X(C11H10ClNO4)]
method: RPBEPBE
basis: SDD
operation: Freq
keyword: #p
keyword: freq=noraman
keyword: PBEPBE/SDD
title: #p freq=noraman PBEPBE/SDD
converged: YES YES NO NO
title: Mulliken charges:
elementType: Cl O O O O N C C C C C C C C C C C H H H H H H H H H H
charge: -0.023365 -0.263468 -0.207209 -0.195756 -0.240903 0.034092 0.487879 0.390191 -0.369715 -0.410296 -0.309204 -0.359065 -0.232162 -0.248237 -0.215790 0.314644 -0.749761 0.295269 0.254693 0.278813 0.260197 0.264074 0.243563 0.244947 0.262801 0.248497 0.245272
chargesum: 0.00000
title: Mulliken charges with hydrogens summed into heavy atoms:
elementType: Cl O O O O N C C C C C C C C C C C
charge: -0.023365 -0.263468 -0.207209 -0.195756 -0.240903 0.034092 0.487879 0.390191 -0.074447 0.123210 -0.309204 -0.098868 0.031912 -0.004674 0.029157 0.314644 0.006809
polarizability: 2.39512745e+02 -2.04640503e+01 1.61766046e+02 1.74620410e+01 1.72706032e+01 9.70480411e+01
1716.lowfreq: -1.3137 0.0008 0.0014 0.0017 1.7051 4.1717 21.7759 38.5725 44.5313
frequency: 21.7428 38.5610 44.5300 66.8359 73.2641 79.3549 87.8165 109.8987 153.3596 187.7028 215.9106 241.7615 261.5013 290.5268 333.6216 374.2762 392.7556 422.6919 454.7727 483.4362 524.4776 547.9638 568.1355 587.7330 612.1524 652.9817 681.9345 694.8694 731.7243 763.5147 799.4576 817.0971 843.9859 872.6654 925.6456 937.0000 956.1451 990.2349 992.1074 1005.9467 1022.2637 1041.7122 1042.5447 1081.7804 1130.0317 1176.1562 1185.1550 1197.0257 1214.6359 1241.0987 1287.0580 1329.2561 1351.0829 1377.5847 1381.0522 1387.0831 1425.7103 1453.1805 1454.5879 1458.9249 1463.9136 1563.4088 1600.0813 1652.1084 1667.1593 3007.9113 3017.7604 3096.7035 3101.1603 3117.5410 3142.5918 3144.3373 3153.7711 3167.9590 3180.2498
redmass: 7.1633 8.2579 4.8369 9.5014 5.6973 2.7618 1.3577 5.5078 4.9886 8.5429 7.3300 7.0830 8.7013 2.8199 4.4394 5.2545 6.9585 3.9955 3.4797 5.1871 3.6445 3.9049 4.5767 6.2473 4.9897 6.0266 4.8338 7.1715 4.3295 1.3061 5.2319 5.6248 5.1798 1.3535 2.8555 1.9485 1.3970 1.3891 2.0713 2.4653 5.5489 1.9310 1.7548 2.4982 1.7257 1.0930 3.4966 6.6591 1.5010 1.2920 1.6027 1.3714 2.8046 6.1829 1.7670 1.8628 2.3048 1.0534 1.0568 1.6020 1.5031 5.7818 6.9109 9.0314 9.6603 1.0380 1.0592 1.1031 1.0949 1.0875 1.0861 1.1022 1.0907 1.0955 1.1001
irintensity: 0.1607 0.9441 2.5687 0.2611 0.1923 2.8368 0.4472 3.7258 0.4159 0.1402 0.4197 3.5923 11.2757 3.1226 9.8714 2.4463 4.8102 8.9896 10.5389 7.3192 12.6213 4.6403 4.1904 15.4970 1.9441 0.3973 9.4726 21.8449 4.6764 89.9844 55.2847 19.7045 7.9376 4.1967 53.7507 57.7340 8.4847 8.0175 91.8180 6.9768 46.9569 8.7544 5.7619 12.2837 1.5438 9.6409 211.1022 474.7219 10.1943 3.3946 11.0961 6.2564 17.8178 81.2575 38.0991 58.5474 38.9128 20.3445 23.8048 2.2628 23.5983 9.0491 21.5884 51.8984 197.3542 0.9605 34.3290 6.7336 6.8437 5.8993 0.6397 9.6399 8.1313 8.6273 10.0135
temp: 298.150 k
press: 1.00000 atm
elementType: 17 8 8 8 8 7 6 6 6 6 6 6 6 6 6 6 6 1 1 1 1 1 1 1 1 1 1
symmnumber: 1
zpe: 503356.7 jmol-1
zpe.correction: 0.191718 hartree
zpe.thermalcorrener: 0.208269 hartree
zpe.thermalcorrenthalpy: 0.209213 hartree
zpe.thermalcorrgfe: 0.144604 hartree
zpe.sumelectzpe: -1239.541536 hartree
zpe.sumelectthermal: -1239.524986 hartree
zpe.sumelectthermalent: -1239.524042 hartree
zpe.sumelectthermalfe: -1239.588651 hartree
dipole: 4.6831 -4.0292 1.3522
dipole: 6.3241
quadrupole: -100.5386 -110.4994 -103.8251
quadrupole: -7.9334 -11.3046 3.1855
quadrupole: 4.4157 -5.5450 1.1293 -7.9334 -11.3046 3.1855
hfenergy: -1239.7332549 hartree
pointgroup: C01 [X(C11H10Cl1N1O4)]
dipole: -2.0644088 -1.3662666 0.2493706 debye
polarizability: 241.3222978|20.7325844|113.4564738|15.2915924|-31.2623147|143.5480605 unknown
InChI: InChI=1S/C11H10ClNO4/c1-8(14)17-7-10(13(15)16)6-9-4-2-3-5-11(9)12/h2-6H,7H2,1H3
charge 0 multiplicity 1
27 atoms
Cl -2.625264 1.012647 -2.768657
O  2.144676 -1.083266 -0.068353
O  1.454028 2.75104 -1.11386
O  2.842057 1.64124 0.3142
O  3.452323 -1.438151 1.837308
N  1.707951 1.794841 -0.285522
C  -1.855468 0.348921 -0.145076
C  0.638875 0.799895 0.033941
C  -0.617567 1.091856 -0.416803
C  1.118129 -0.413451 0.77976
C  -2.885324 0.266534 -1.125531
C  -2.128358 -0.248774 1.123258
C  -4.102481 -0.396662 -0.893146
C  -3.344867 -0.911237 1.377571
C  -4.331391 -0.993304 0.367678
C  3.317484 -1.500848 0.598464
C  4.330847 -1.994248 -0.405335
H  -0.701215 1.986144 -1.049172
H  0.292999 -1.12989 0.912597
H  1.57676 -0.176218 1.757163
H  -1.398304 -0.133822 1.930814
H  -4.857209 -0.445864 -1.682943
H  -3.529438 -1.349002 2.363567
H  -5.279478 -1.5066 0.557499
H  4.827976 -1.121762 -0.867236
H  3.842244 -2.565881 -1.210211
H  5.089712 -2.60824 0.101125
