program: Gaussian 09
title: 000157100
version: EM64L-G09RevD.01
frameworkgroup: C1[X(C9H11N3O4S)]
method: RPBEPBE
basis: SDD
operation: Freq
keyword: #p
keyword: freq=noraman
keyword: PBEPBE/SDD
title: #p freq=noraman PBEPBE/SDD
converged: YES YES NO NO
title: Mulliken charges:
elementType: S O O O O N N N C C C C C C C C C H H H H H H H H H H H
charge: 0.934666 -0.532276 -0.492925 -0.270074 -0.263048 -0.611489 -0.648369 -0.598215 -0.165073 0.297185 -0.264624 -0.454104 -0.332476 -0.221693 -0.217576 0.139944 0.248150 0.365266 0.307717 0.258769 0.293929 0.289519 0.247433 0.243716 0.434845 0.330794 0.328684 0.351327
chargesum: 0.00000
title: Mulliken charges with hydrogens summed into heavy atoms:
elementType: S O O O O N N N C C C C C C C C C
charge: 0.934666 -0.532276 -0.492925 -0.270074 -0.263048 -0.246223 0.117269 0.081795 -0.165073 0.297185 0.043092 0.098594 -0.042957 0.025740 0.026140 0.139944 0.248150
polarizability: 1.95399662e+02 -4.85191352e+00 1.64296774e+02 -1.18372309e+01 1.05296020e+01 1.13052474e+02
1716.lowfreq: -6.9795 -2.6301 -0.0019 -0.0015 0.0010 5.0633 19.0663 35.4548 46.6717
frequency: 18.5201 35.4278 46.5901 67.2120 100.5380 114.4564 131.2538 143.4632 184.0778 204.8518 218.3981 237.6107 254.8740 287.9053 311.4689 369.4193 377.9396 411.2272 423.1489 449.0402 476.4686 487.7732 525.4440 540.2313 545.9978 596.9721 616.7120 625.3078 640.0276 643.6421 703.4321 744.1599 753.3976 790.7647 802.7924 807.4780 906.1342 913.5698 957.2785 974.1736 980.7872 984.7414 1003.0037 1007.9211 1036.8935 1056.9438 1093.8928 1106.4340 1127.5213 1150.9205 1175.2285 1219.1532 1257.3955 1262.8228 1317.2122 1362.4201 1368.0395 1379.4507 1417.7828 1449.4126 1450.2774 1557.6627 1596.2231 1599.8727 1610.9271 1656.3368 1678.4629 2930.6522 3042.0565 3115.3765 3141.8514 3151.5888 3162.4761 3174.5575 3181.1814 3518.8330 3588.3422 3669.3001
redmass: 5.4939 5.5001 5.9418 7.1518 5.4953 5.6962 6.8362 5.7961 4.9231 6.6574 6.7185 5.8503 8.1470 7.0689 6.2380 5.1819 6.8631 4.2588 7.6682 2.4955 1.9271 3.6026 4.7965 3.8020 1.4154 4.3615 1.5834 4.4006 5.5240 1.6010 2.7638 4.6618 3.0078 1.4838 10.0132 3.1583 1.3769 1.6315 3.4487 3.2458 3.0464 1.3934 1.5286 1.3591 2.7145 2.0252 2.4870 2.1516 2.2386 1.5841 1.0618 1.0986 1.4356 1.1532 1.6893 3.2600 5.9567 2.3013 2.3601 1.2290 1.9160 6.0342 6.8106 1.4282 6.3046 3.4841 1.1822 1.0661 1.0931 1.0767 1.0862 1.0900 1.0941 1.1007 1.0717 1.0452 1.0835 1.1045
irintensity: 0.8231 0.4869 3.5670 6.5730 3.5727 1.6491 6.2001 7.2415 1.7518 15.0376 0.9880 20.5049 1.6907 5.7000 21.1764 26.3803 19.8769 6.8095 54.7765 9.9548 29.3206 9.9500 30.8004 8.4150 144.5515 14.0725 25.7500 23.4668 29.6290 115.8856 68.1455 8.4267 47.2775 50.5534 61.7125 74.2993 3.7443 142.3022 82.1552 16.6363 4.7007 4.9006 24.7100 1.8606 4.1758 1.4462 18.4866 15.0300 1.4013 7.6435 2.1209 3.6637 2.8477 44.5373 245.9388 133.9983 4.9803 83.9214 19.6212 11.4525 1.5498 8.0124 37.3725 74.4526 188.8164 270.8756 104.4095 40.1409 12.9541 557.8462 9.8178 2.4314 4.2438 27.6286 192.3578 58.7162 64.6956 36.0721
temp: 298.150 k
press: 1.00000 atm
elementType: 16 8 8 8 8 7 7 7 6 6 6 6 6 6 6 6 6 1 1 1 1 1 1 1 1 1 1 1
symmnumber: 1
zpe: 532476.6 jmol-1
zpe.correction: 0.202810 hartree
zpe.thermalcorrener: 0.219811 hartree
zpe.thermalcorrenthalpy: 0.220755 hartree
zpe.thermalcorrgfe: 0.156461 hartree
zpe.sumelectzpe: -1211.362413 hartree
zpe.sumelectthermal: -1211.345411 hartree
zpe.sumelectthermalent: -1211.344467 hartree
zpe.sumelectthermalfe: -1211.408762 hartree
dipole: -3.1090 -5.2122 -7.4833
dipole: 9.6350
quadrupole: -93.7018 -107.6535 -111.8754
quadrupole: -7.2137 12.0475 4.9037
quadrupole: 10.7085 -3.2433 -7.4652 -7.2137 12.0475 4.9037
hfenergy: -1211.5652225 hartree
pointgroup: C01 [X(C9H11N3O4S1)]
dipole: -1.2455907 -2.9876932 -1.9727071 debye
polarizability: 194.6177488|-8.2526383|164.4205104|-13.7210616|-8.6992897|113.7106501 unknown
InChI: InChI=1S/C9H11N3O4S/c10-8(13)5-12-17(15,16)7-4-2-1-3-6(7)9(11)14/h1-4,12H,5,10-11H2
charge 0 multiplicity 1
28 atoms
S  -0.331666 0.111396 1.199867
O  -0.877627 -1.188426 2.030864
O  -0.108765 1.536691 1.93229
O  2.727625 2.504609 -1.343676
O  -4.240262 0.799791 -0.06721
N  -1.573581 0.459633 -0.213049
N  0.437536 2.093701 -1.351937
N  -4.755404 -1.243637 -1.050534
C  1.234027 -0.489996 0.255043
C  1.99798 0.31707 -0.619961
C  1.596572 -1.797584 0.629243
C  -2.387405 -0.731238 -0.549295
C  3.19986 -0.265264 -1.109748
C  2.782026 -2.350751 0.099381
C  3.58717 -1.575494 -0.765217
C  1.739228 1.741221 -1.109097
C  -3.87758 -0.319962 -0.535217
H  -2.220902 1.182275 0.196021
H  0.967513 -2.352373 1.333071
H  -2.097638 -1.121897 -1.540861
H  -2.23802 -1.533488 0.208532
H  3.821528 0.363412 -1.755279
H  3.077983 -3.366797 0.379176
H  4.519352 -1.988163 -1.164676
H  -0.371631 1.466502 -1.15193
H  0.272441 3.053963 -1.657262
H  -4.447235 -2.143024 -1.416886
H  -5.752324 -1.02727 -1.042751
